{"text_format":"1","workbook":"xlsx","n_sheets":5,"sheets":["Data_Entry","LEGEND","Example_legends","ColorBrewer","Metadata"],"not_rendered":{"charts":0,"images":0,"macros":1,"external_links":0,"defined_names":7,"comments":1,"pivot_tables":0},"unopened":[],"bounds":{"document_bytes":16777216,"sheet_cells":100000,"rows_first":2000,"rows_last":500,"rows_between":2000,"halvings":0,"cell_chars":16384,"cell_head_chars":4096},"cells_cut":0,"cells_raw":0,"read":"whole","date_system":"1900"}

{"sheet":"Data_Entry","index":0,"n_rows":48,"n_cols":8,"rows_kept":48,"cut":false,"hidden":false,"merged":[]}
["GLOBE Global Variable Metadata Template"]
["Version: April 16, 2015"]
["Downloaded from:"]
["http://globe.umbc.edu/creating-globes-global-variables/"]
[]
["INSTRUCTIONS:"]
["1) Fill-in the requested metadata in the Enter Data column. Example text is provided below, and for other variables at right."]
["2) Produce a map legend using the LEGEND sheet, as described on that sheet."]
["3) When all of the Enter Data cells have been entered, and the LEGEND sheet is completed, this template is complete,"]
["4) Please save this file and rename it by replacing \"TEMPLATE_\" with \"Label_\" (as in Enter Data below)"]
[]
[]
[]
[null,null,null,null,null,"Examples"]
[]
["Metadata","Enter Data","Standards for Data","Link to more information",null,"ESRI World Regions","Forest cover loss (2000 to 2005)","Biogeographic Realms"]
["Type","H","M = metadata, S = land/water, C = climate, H = human, B = biological, R = remote sensing",null,null,"H","H","B"]
["Label","esri_wr25","10 character variable name: no spaces or special characters allowed, except \"_\"",null,null,"esri_wr25","deforest05","wwf_realms"]
["Variable","World Regions (ESRI 25)","A full name for the variable: up to 255 characters",null,null,"World Regions (ESRI 25)","Forest cover loss (2000 to 2005)","Biogeographic Realms"]
["Units","regions","The units of the variable, for example: %, kg/ha, regions, biomes, persons per square kilometer,….",null,null,"regions","%","Realms"]
["Description","Boundaries for 25 commonly recognized regions of the world.","A full description of the variable: up to 255 characters",null,null,"Boundaries for 25 commonly recognized regions of the world.","This dataset represents 2000-2005 gross forest cover loss, at approximately 20 km resolution.  ","Global Biogeographic Realms based on Olson et al., 2001"]
["Source","From ArcGIS online: http://www.arcgis.com/home/item.html?id=84dbc97915244e35808e87a881133d09","Where the data were obtained: if there is a link to the source online, this is essential source information, and may contain additional free text description of source.",null,null,"From ArcGIS online: http://www.arcgis.com/home/item.html?id=84dbc97915244e35808e87a881133d09","Reprocessed from data downloaded here: http://globalmonitoring.sdstate.edu/projects/gfm/global/gindex.html\n","Downloaded from: https://worldwildlife.org/publications/terrestrial-ecoregions-of-the-world"]
["Live Link","http://www.arcgis.com/home/item.html?id=84dbc97915244e35808e87a881133d09","An http:// address only. This is essential source information and should not contain any additional free text."]
["Citation","ESRI. World Regions. http://www.arcgis.com/home/item.html?id=84dbc97915244e35808e87a881133d09 <downloaded April 2, 2014>","Fully formatted citation for the variable, as it should appear when citing the use of the variable in an analysis.",null,null,"ESRI. World Regions. http://www.arcgis.com/home/item.html?id=84dbc97915244e35808e87a881133d09","Hansen, M. C., S. V. Stehman, and P. V. Potapov. 2010. Quantification of global gross forest cover loss. Proceedings of the National Academy of Sciences 107:8650-8655.\n","Olson et al.  2001. Terrestrial ecoregions of the world: a new map of life on Earth. BioScience 51:933-938.  DOI: 10.1641/0006-3568(2001)051[0933:TEOTWA]2.0.CO;2"]
["NOTE","Erle processed these data. This is an update to improve coverage.  Used a 100 cell square nearest neighbor analysis to expand range of cover.","[PRIVATE] Name of the individual who processed the dataset, and any non-public notes on the data. These are not published with the data. If this is a variable update, please give a reason for update & change made.","N/A",null,"Erle processed these data. Converted from polygon to 30s raster","Erle processed these data. The data is sinusoidal ~19 km square grid geotiff: \n1) open directly in arcgis (10.2.1)\n2) multiply by 1 and save as ArcGRID = hansen_2010n (native- same projection)\n3) multiply hansen_2010n by dgg_cover_30s (GLU cover = 1; 30s), set environment extent/res = this layer.  This creates a 30s GRID version = = hansen10_30s\n4) eliminated strange negative values by using a CON function, leaving only cells >=0. = hansen10_30sp\n5) run zonal stats on hansen10_30sp; checked: best is to use mean value for GLUs - but definitely causes some transformation of the original.","Erle processed these data. Converted from polygon to 30s raster, then used a 50 cell radius nearest neighbor (focal stat) majority analysis to expand range of cover."]
["Native","polygons","Native resolution of the original geodata, e.g.: polygons, 30 arc second GRID, 5 arc minute GRID, etc",null,null,"polygons","18.5 km GRID","polygons"]
["Geoprocessing Code",5,"Code for method used to process data into GLOBE GLU format. See link at right for the methods and their codes.","http://globe.umbc.edu/documentation/geoprocessing-methods/",null,5,2,5]
["Extrapolated?","y","Were these geodata extrapolated to improve their coverage?  (y or n)",null,null,"n","n","y"]
["Data Type","nominal","data type: continuous (continuous variable, eg temperature), nominal (categories with names), ordinal (ordered list), or integer",null,null,"nominal","continuous","nominal"]
["Min",1,"Lowest value",null,null,1,0,1]
["Max",25,"Highest value",null,null,25,85.809453000000005,8]
["Step",1,"The smallest increment of data values to be displayed (usually 1 for nominal), for continuous, select smallest useful distinguishing value, eg.",null,null,1,0.01,1]
["Missing Value",0,"Value in provided database for missing values  (e.g. = 0; -9999999).  If there is no \"missing value\" then enter \"NULL\"",null,null,0,"NULL",0]
["# of Map Legend Colors",{"$f":"LEGEND!B17","v":25},"AUTOMATIC: Updated from LEGEND",null,null,"See LEGEND Example","See LEGEND Example","See LEGEND Example"]
["Coloring",{"$f":"LEGEND!W19","v":"0xE1E1E1,0x07DEA4,0x2816F0,0xEDDB34,0x2774D9,0xFFFF73,0x54F224,0xE825D5,0xCD8966,0xA9D1D6,0x280D54,0xDB0B1C,0x8C7238,0xE4AEFC,0xAEDB81,0x8057E6,0x13B5CF,0x38A800,0x664773,0x898C88,0x700604,0xEFE4BE,0xF52265,0xCDCD66,0xE065CA"},"AUTOMATIC: Updated from LEGEND",null,null,"See LEGEND Example","See LEGEND Example","See LEGEND Example"]
["Bins",{"$f":"LEGEND!W18","v":"1:1,2:2,3:3,4:4,5:5,6:6,7:7,8:8,9:9,10:10,11:11,12:12,13:13,14:14,15:15,16:16,17:17,18:18,19:19,20:20,21:21,22:22,23:23,24:24,25:25"},"AUTOMATIC: Updated from LEGEND",null,null,"See LEGEND Example","See LEGEND Example","See LEGEND Example"]
["Bin Labels",{"$f":"LEGEND!W17","v":"[\"Antarctica\",\"Asiatic Russia\",\"Australia/New Zealand\",\"Caribbean\",\"Central America\",\"Central Asia\",\"Eastern Africa\",\"Eastern Asia\",\"Eastern Europe\",\"European Russia\",\"Melanesia\",\"Micronesia\",\"Middle Africa\",\"Northern Africa\",\"Northern America\",\"Northern Europe\",\"Polynesia\",\"South America\",\"Southeastern Asia\",\"Southern Africa\",\"Southern Asia\",\"Southern Europe\",\"Western Africa\",\"Western Asia\",\"Western Europe\"]"},"AUTOMATIC: Updated from LEGEND",null,null,"See LEGEND Example","See LEGEND Example","See LEGEND Example"]
["Categories",{"$f":"LEGEND!W20","v":"{ \"No Data\": 0, \"Antarctica\": 1, \"Asiatic Russia\": 2, \"Australia/New Zealand\": 3, \"Caribbean\": 4, \"Central America\": 5, \"Central Asia\": 6, \"Eastern Africa\": 7, \"Eastern Asia\": 8, \"Eastern Europe\": 9, \"European Russia\": 10, \"Melanesia\": 11, \"Micronesia\": 12, \"Middle Africa\": 13, \"Northern Africa\": 14, \"Northern America\": 15, \"Northern Europe\": 16, \"Polynesia\": 17, \"South America\": 18, \"Southeastern Asia\": 19, \"Southern Africa\": 20, \"Southern Asia\": 21, \"Southern Europe\": 22, \"Western Africa\": 23, \"Western Asia\": 24, \"Western Europe\": 25}"},"AUTOMATIC: Updated from LEGEND",null,null,"See LEGEND Example","See LEGEND Example","See LEGEND Example"]
["Public_Note","Use with reference to ESRI","Notes on the global variable helpful to users."]
["p_Native",null,"Percentage (0-100) of global land area covered by the global variable in its native format (before GLOBE processing)."]
["p_Extrapolated",null,"Percentage (0-100) of global land area covered by extrapolating the global variable to enhance its coverage of global land area."]
["p_NODATA",null,"Percentage (0-100) of global land area not covered by the global variable."]
["Native_Min",1,"MIN value in native global variable before GLOBE processing."]
["Native_Max",25,"MAX value in native global variable before GLOBE processing."]
["Native_Median",null,"MEDIAN value in native global variable before GLOBE processing."]
["Native_Mean",null,"MEAN value in native global variable before GLOBE processing."]
["GLOBE_Median",null,"Area-weighted MEDIAN value of global variable after GLOBE processing."]
["GLOBE_Mean",null,"Area-weighted MEAN value of global variable after GLOBE processing."]

{"sheet":"LEGEND","index":1,"n_rows":72,"n_cols":31,"rows_kept":72,"cut":false,"hidden":false,"merged":[]}
["MAP LEGEND for GLOBAL VARIABLE"]
["Create a standard map legend for viewing the variable in GLOBE"]
[">> To get started, look at the Example Legends sheet for examples of different map legends"]
[">> Up to 50 different colors/categories/symbols can be used for a single variable using this template: if more are needed, please contact globe@umbc.edu for help."]
["1) First, enter the total number of colors/categories/symbols/bins that you intend to use in the red box below. "]
["2) Enter/paste the LOW and HIGH values for each color/category/symbol.  Note: for nominal and ordinal data, low and high values are generally equal: see Examples below"]
["3) Enter/paste the LABEL for each color/category/symbol.  For continuous variables, this can be specified, but if it is left blank, the RANGE will be used."]
["4) DELETE: any example text remaining in the template below within the hatched area (extra LOW/HIGH/LABEL/R/G/B)."]
["5) Enter/paste the Red (R), Green (G), and Blue (B) values for each color/category/symbol.  "]
[null,"There are two major ways to generate the RGB colors for your map:"]
[null,"A) Use colors or select a color legend from the ColorBrewer Sheet."]
[null,"B) Use ArcGIS or another GIS to create map symbols with RGB colors; then cut and paste the color codes. (For ArcGIS, Export the Colormap as a .CLR file- this contains the RGB codes)."]
[null,null,"or try this","http://www.rapidtables.com/web/color/RGB_Color.htm"]
[]
["MAP LEGEND TEMPLATE"]
[]
[null,25,"Number of colors/categories/symbols for the map legend ",null,null,null,null,null,null,null,null,null,null,null,null,null,null,null,null,null,null,"BINLABELS =",{"$f":"\"[\"\"\"&IF(ISBLANK(E23),\"\",E23)&IF(ISBLANK(E24),\"\",\"\"\",\"\"\"&E24)&IF(ISBLANK(E25),\"\",\"\"\",\"\"\"&E25)&IF(ISBLANK(E26),\"\",\"\"\",\"\"\"&E26)&IF(ISBLANK(E27),\"\",\"\"\",\"\"\"&E27)&IF(ISBLANK(E28),\"\",\"\"\",\"\"\"&E28)&IF(ISBLANK(E29),\"\",\"\"\",\"\"\"&E29)&IF(ISBLANK(E30),\"\",\"\"\",\"\"\"&E30)&IF(ISBLANK(E31),\"\",\"\"\",\"\"\"&E31)&IF(ISBLANK(E32),\"\",\"\"\",\"\"\"&E32)&IF(ISBLANK(E33),\"\",\"\"\",\"\"\"&E33)&IF(ISBLANK(E34),\"\",\"\"\",\"\"\"&E34)&IF(ISBLANK(E35),\"\",\"\"\",\"\"\"&E35)&IF(ISBLANK(E36),\"\",\"\"\",\"\"\"&E36)&IF(ISBLANK(E37),\"\",\"\"\",\"\"\"&E37)&IF(ISBLANK(E38),\"\",\"\"\",\"\"\"&E38)&IF(ISBLANK(E39),\"\",\"\"\",\"\"\"&E39)&IF(ISBLANK(E40),\"\",\"\"\",\"\"\"&E40)&IF(ISBLANK(E41),\"\",\"\"\",\"\"\"&E41)&IF(ISBLANK(E42),\"\",\"\"\",\"\"\"&E42)&IF(ISBLANK(E43),\"\",\"\"\",\"\"\"&E43)&IF(ISBLANK(E44),\"\",\"\"\",\"\"\"&E44)&IF(ISBLANK(E45),\"\",\"\"\",\"\"\"&E45)&IF(ISBLANK(E46),\"\",\"\"\",\"\"\"&E46)&IF(ISBLANK(E47),\"\",\"\"\",\"\"\"&E47)&IF(ISBLANK(E48),\"\",\"\"\",\"\"\"&E48)&IF(ISBLANK(E49),\"\",\"\"\",\"\"\"&E49)&IF(ISBLANK(E50),\"\",\"\"\",\"\"\"&E50)&IF(ISBLANK(E51),\"\",\"\"\",\"\"\"&E51)&IF(ISBLANK(E52),\"\",\"\"\",\"\"\"&E52)&IF(ISBLANK(E53),\"\",\"\"\",\"\"\"&E53)&IF(ISBLANK(E54),\"\",\"\"\",\"\"\"&E54)&IF(ISBLANK(E55),\"\",\"\"\",\"\"\"&E55)&IF(ISBLANK(E56),\"\",\"\"\",\"\"\"&E56)&IF(ISBLANK(E57),\"\",\"\"\",\"\"\"&E57)&IF(ISBLANK(E58),\"\",\"\"\",\"\"\"&E58)&IF(ISBLANK(E59),\"\",\"\"\",\"\"\"&E59)&IF(ISBLANK(E60),\"\",\"\"\",\"\"\"&E60)&IF(ISBLANK(E61),\"\",\"\"\",\"\"\"&E61)&IF(ISBLANK(E62),\"\",\"\"\",\"\"\"&E62)&IF(ISBLANK(E63),\"\",\"\"\",\"\"\"&E63)&IF(ISBLANK(E64),\"\",\"\"\",\"\"\"&E64)&IF(ISBLANK(E65),\"\",\"\"\",\"\"\"&E65)&IF(ISBLANK(E66),\"\",\"\"\",\"\"\"&E66)&IF(ISBLANK(E67),\"\",\"\"\",\"\"\"&E67)&IF(ISBLANK(E68),\"\",\"\"\",\"\"\"&E68)&IF(ISBLANK(E69),\"\",\"\"\",\"\"\"&E69)&IF(ISBLANK(E70),\"\",\"\"\",\"\"\"&E70)&IF(ISBLANK(E71),\"\",\"\"\",\"\"\"&E71)&IF(ISBLANK(E72),\"\",\"\"\",\"\"\"&E72)&\"\"\"]\"","v":"[\"Antarctica\",\"Asiatic Russia\",\"Australia/New Zealand\",\"Caribbean\",\"Central America\",\"Central Asia\",\"Eastern Africa\",\"Eastern Asia\",\"Eastern Europe\",\"European Russia\",\"Melanesia\",\"Micronesia\",\"Middle Africa\",\"Northern Africa\",\"Northern America\",\"Northern Europe\",\"Polynesia\",\"South America\",\"Southeastern Asia\",\"Southern Africa\",\"Southern Asia\",\"Southern Europe\",\"Western Africa\",\"Western Asia\",\"Western Europe\"]"}]
["Blue text cells are not editable: they are updated automatically",null,null,null,null,null,null,null,null,null,null,null,null,null,null,null,null,null,null,null,null,"BINS = ",{"$f":"IF(D23=\"\",\"\",D23)&IF(D24=\"\",\"\",\",\"&D24)&IF(D25=\"\",\"\",\",\"&D25)&IF(D26=\"\",\"\",\",\"&D26)&IF(D27=\"\",\"\",\",\"&D27)&IF(D28=\"\",\"\",\",\"&D28)&IF(D29=\"\",\"\",\",\"&D29)&IF(D30=\"\",\"\",\",\"&D30)&IF(D31=\"\",\"\",\",\"&D31)&IF(D32=\"\",\"\",\",\"&D32)&IF(D33=\"\",\"\",\",\"&D33)&IF(D34=\"\",\"\",\",\"&D34)&IF(D35=\"\",\"\",\",\"&D35)&IF(D36=\"\",\"\",\",\"&D36)&IF(D37=\"\",\"\",\",\"&D37)&IF(D38=\"\",\"\",\",\"&D38)&IF(D39=\"\",\"\",\",\"&D39)&IF(D40=\"\",\"\",\",\"&D40)&IF(D41=\"\",\"\",\",\"&D41)&IF(D42=\"\",\"\",\",\"&D42)&IF(D43=\"\",\"\",\",\"&D43)&IF(D44=\"\",\"\",\",\"&D44)&IF(D45=\"\",\"\",\",\"&D45)&IF(D46=\"\",\"\",\",\"&D46)&IF(D47=\"\",\"\",\",\"&D47)&IF(D48=\"\",\"\",\",\"&D48)&IF(D49=\"\",\"\",\",\"&D49)&IF(D50=\"\",\"\",\",\"&D50)&IF(D51=\"\",\"\",\",\"&D51)&IF(D52=\"\",\"\",\",\"&D52)&IF(D53=\"\",\"\",\",\"&D53)&IF(D54=\"\",\"\",\",\"&D54)&IF(D55=\"\",\"\",\",\"&D55)&IF(D56=\"\",\"\",\",\"&D56)&IF(D57=\"\",\"\",\",\"&D57)&IF(D58=\"\",\"\",\",\"&D58)&IF(D59=\"\",\"\",\",\"&D59)&IF(D60=\"\",\"\",\",\"&D60)&IF(D61=\"\",\"\",\",\"&D61)&IF(D62=\"\",\"\",\",\"&D62)&IF(D63=\"\",\"\",\",\"&D63)&IF(D64=\"\",\"\",\",\"&D64)&IF(D65=\"\",\"\",\",\"&D65)&IF(D66=\"\",\"\",\",\"&D66)&IF(D67=\"\",\"\",\",\"&D67)&IF(D68=\"\",\"\",\",\"&D68)&IF(D69=\"\",\"\",\",\"&D69)&IF(D70=\"\",\"\",\",\"&D70)&IF(D71=\"\",\"\",\",\"&D71)&IF(D72=\"\",\"\",\",\"&D72)","v":"1:1,2:2,3:3,4:4,5:5,6:6,7:7,8:8,9:9,10:10,11:11,12:12,13:13,14:14,15:15,16:16,17:17,18:18,19:19,20:20,21:21,22:22,23:23,24:24,25:25"}]
["If more than 50 categories are needed for the legend, please contact globe@umbc.edu for help.",null,null,null,null,null,null,null,null,null,null,null,null,null,null,null,null,null,null,null,null,"COLORING (HEX) = ",{"$f":"IF(J23=\"\",\"\",J23)&IF(J24=\"\",\"\",\",\"&J24)&IF(J25=\"\",\"\",\",\"&J25)&IF(J26=\"\",\"\",\",\"&J26)&IF(J27=\"\",\"\",\",\"&J27)&IF(J28=\"\",\"\",\",\"&J28)&IF(J29=\"\",\"\",\",\"&J29)&IF(J30=\"\",\"\",\",\"&J30)&IF(J31=\"\",\"\",\",\"&J31)&IF(J32=\"\",\"\",\",\"&J32)&IF(J33=\"\",\"\",\",\"&J33)&IF(J34=\"\",\"\",\",\"&J34)&IF(J35=\"\",\"\",\",\"&J35)&IF(J36=\"\",\"\",\",\"&J36)&IF(J37=\"\",\"\",\",\"&J37)&IF(J38=\"\",\"\",\",\"&J38)&IF(J39=\"\",\"\",\",\"&J39)&IF(J40=\"\",\"\",\",\"&J40)&IF(J41=\"\",\"\",\",\"&J41)&IF(J42=\"\",\"\",\",\"&J42)&IF(J43=\"\",\"\",\",\"&J43)&IF(J44=\"\",\"\",\",\"&J44)&IF(J45=\"\",\"\",\",\"&J45)&IF(J46=\"\",\"\",\",\"&J46)&IF(J47=\"\",\"\",\",\"&J47)&IF(J48=\"\",\"\",\",\"&J48)&IF(J49=\"\",\"\",\",\"&J49)&IF(J50=\"\",\"\",\",\"&J50)&IF(J51=\"\",\"\",\",\"&J51)&IF(J52=\"\",\"\",\",\"&J52)&IF(J53=\"\",\"\",\",\"&J53)&IF(J54=\"\",\"\",\",\"&J54)&IF(J55=\"\",\"\",\",\"&J55)&IF(J56=\"\",\"\",\",\"&J56)&IF(J57=\"\",\"\",\",\"&J57)&IF(J58=\"\",\"\",\",\"&J58)&IF(J59=\"\",\"\",\",\"&J59)&IF(J60=\"\",\"\",\",\"&J60)&IF(J61=\"\",\"\",\",\"&J61)&IF(J62=\"\",\"\",\",\"&J62)&IF(J63=\"\",\"\",\",\"&J63)&IF(J64=\"\",\"\",\",\"&J64)&IF(J65=\"\",\"\",\",\"&J65)&IF(J66=\"\",\"\",\",\"&J66)&IF(J67=\"\",\"\",\",\"&J67)&IF(J68=\"\",\"\",\",\"&J68)&IF(J69=\"\",\"\",\",\"&J69)&IF(J70=\"\",\"\",\",\"&J70)&IF(J71=\"\",\"\",\",\"&J71)&IF(J72=\"\",\"\",\",\"&J72)","v":"0xE1E1E1,0x07DEA4,0x2816F0,0xEDDB34,0x2774D9,0xFFFF73,0x54F224,0xE825D5,0xCD8966,0xA9D1D6,0x280D54,0xDB0B1C,0x8C7238,0xE4AEFC,0xAEDB81,0x8057E6,0x13B5CF,0x38A800,0x664773,0x898C88,0x700604,0xEFE4BE,0xF52265,0xCDCD66,0xE065CA"}]
[null,null,null,null,null,null,null,null,null,null,null,null,null,null,null,null,null,null,null,null,null,"CATEGORIES = ",{"$f":"\"{ \"\"No Data\"\": \"&Data_Entry!B33&\", \"&IF(K23=\"\",\"\",K23)&IF(K24=\"\",\"\",\", \"&K24)&IF(K25=\"\",\"\",\", \"&K25)&IF(K26=\"\",\"\",\", \"&K26)&IF(K27=\"\",\"\",\", \"&K27)&IF(K28=\"\",\"\",\", \"&K28)&IF(K29=\"\",\"\",\", \"&K29)&IF(K30=\"\",\"\",\", \"&K30)&IF(K31=\"\",\"\",\", \"&K31)&IF(K32=\"\",\"\",\", \"&K32)&IF(K33=\"\",\"\",\", \"&K33)&IF(K34=\"\",\"\",\", \"&K34)&IF(K35=\"\",\"\",\", \"&K35)&IF(K36=\"\",\"\",\", \"&K36)&IF(K37=\"\",\"\",\", \"&K37)&IF(K38=\"\",\"\",\", \"&K38)&IF(K39=\"\",\"\",\", \"&K39)&IF(K40=\"\",\"\",\", \"&K40)&IF(K41=\"\",\"\",\", \"&K41)&IF(K42=\"\",\"\",\", \"&K42)&IF(K43=\"\",\"\",\", \"&K43)&IF(K44=\"\",\"\",\", \"&K44)&IF(K45=\"\",\"\",\", \"&K45)&IF(K46=\"\",\"\",\", \"&K46)&IF(K47=\"\",\"\",\", \"&K47)&IF(K48=\"\",\"\",\", \"&K48)&IF(K49=\"\",\"\",\", \"&K49)&IF(K50=\"\",\"\",\", \"&K50)&IF(K51=\"\",\"\",\", \"&K51)&IF(K52=\"\",\"\",\", \"&K52)&IF(K53=\"\",\"\",\", \"&K53)&IF(K54=\"\",\"\",\", \"&K54)&IF(K55=\"\",\"\",\", \"&K55)&IF(K56=\"\",\"\",\", \"&K56)&IF(K57=\"\",\"\",\", \"&K57)&IF(K58=\"\",\"\",\", \"&K58)&IF(K59=\"\",\"\",\", \"&K59)&IF(K60=\"\",\"\",\", \"&K60)&IF(K61=\"\",\"\",\", \"&K61)&IF(K62=\"\",\"\",\", \"&K62)&IF(K63=\"\",\"\",\", \"&K63)&IF(K64=\"\",\"\",\", \"&K64)&IF(K65=\"\",\"\",\", \"&K65)&IF(K66=\"\",\"\",\", \"&K66)&IF(K67=\"\",\"\",\", \"&K67)&IF(K68=\"\",\"\",\", \"&K68)&IF(K69=\"\",\"\",\", \"&K69)&IF(K70=\"\",\"\",\", \"&K70)&IF(K71=\"\",\"\",\", \"&K71)&IF(K72=\"\",\"\",\", \"&K72)&\"}\"","v":"{ \"No Data\": 0, \"Antarctica\": 1, \"Asiatic Russia\": 2, \"Australia/New Zealand\": 3, \"Caribbean\": 4, \"Central America\": 5, \"Central Asia\": 6, \"Eastern Africa\": 7, \"Eastern Asia\": 8, \"Eastern Europe\": 9, \"European Russia\": 10, \"Melanesia\": 11, \"Micronesia\": 12, \"Middle Africa\": 13, \"Northern Africa\": 14, \"Northern America\": 15, \"Northern Europe\": 16, \"Polynesia\": 17, \"South America\": 18, \"Southeastern Asia\": 19, \"Southern Africa\": 20, \"Southern Asia\": 21, \"Southern Europe\": 22, \"Western Africa\": 23, \"Western Asia\": 24, \"Western Europe\": 25}"}]
[]
["#","LOW","HIGH","RANGE","LABEL","R","G","B","COLOR","HEX","CATEGORIES",null,null,null,null,null,null,null,null,null,null,null,"LABELS",null,null,"BINS",null,"COLORING (HEX)",null,null,"CATEGORIES"]
[1,1,1,{"$f":"IF($A23<=$B$17,B23&\":\"&C23,\"\")","v":"1:1"},"Antarctica",225,225,225,null,{"$f":"IF($A23<=$B$17,\"0x\"&DEC2HEX(F23,2)&DEC2HEX(G23,2)&DEC2HEX(H23,2),\"\")","v":"0xE1E1E1"},{"$f":"IF($A23<=$B$17,\"\"\"\"&E23&\"\"\": \"&B23,\"\")","v":"\"Antarctica\": 1"},null,null,null,null,null,null,null,null,null,1,22,{"$f":"\"IF(ISBLANK(E\"&V23&\"),\"\"\"\",E\"&V23&\")&\"","v":"IF(ISBLANK(E22),\"\",E22)&"},null,null,{"$f":"\"IF(D\"&V23&\"=\"\"\"\",\"\"\"\",D\"&V23&\")&\"","v":"IF(D22=\"\",\"\",D22)&"},null,{"$f":"\"IF(J\"&V23&\"=\"\"\"\",\"\"\"\",J\"&V23&\")&\"","v":"IF(J22=\"\",\"\",J22)&"},null,null,{"$f":"\"IF(K\"&V23&\"=\"\"\"\",\"\"\"\",K\"&V23&\")&\"","v":"IF(K22=\"\",\"\",K22)&"}]
[2,2,2,"2:2","Asiatic Russia",7,222,164,null,"0x07DEA4","\"Asiatic Russia\": 2",null,null,null,null,null,null,null,null,null,2,23,{"$f":"\"IF(ISBLANK(E\"&V24&\"),\"\"\"\",\"\",\"&\"\"\"&E\"&V24&\")&\"","v":"IF(ISBLANK(E23),\"\",\",\"&E23)&"},null,null,{"$f":"\"IF(D\"&V24&\"=\"\"\"\",\"\"\"\",\"\",\"&\"\"\"&D\"&V24&\")&\"","v":"IF(D23=\"\",\"\",\",\"&D23)&"},null,{"$f":"\"IF(J\"&V24&\"=\"\"\"\",\"\"\"\",\"\",\"&\"\"\"&J\"&V24&\")&\"","v":"IF(J23=\"\",\"\",\",\"&J23)&"},null,null,{"$f":"\"IF(K\"&V24&\"=\"\"\"\",\"\"\"\", \"\", \"&\"\"\"&K\"&V24&\")&\"","v":"IF(K23=\"\",\"\", \", \"&K23)&"}]
[3,3,3,"3:3","Australia/New Zealand",40,22,240,null,"0x2816F0","\"Australia/New Zealand\": 3",null,null,null,null,null,null,null,null,null,3,24,"IF(ISBLANK(E24),\"\",\",\"&E24)&",null,null,{"$f":"\"IF(D\"&V25&\"=\"\"\"\",\"\"\"\",\"\",\"&\"\"\"&D\"&V25&\")&\"","v":"IF(D24=\"\",\"\",\",\"&D24)&"},null,"IF(J24=\"\",\"\",\",\"&J24)&",null,null,{"$f":"\"IF(K\"&V25&\"=\"\"\"\",\"\"\"\", \"\", \"&\"\"\"&K\"&V25&\")&\"","v":"IF(K24=\"\",\"\", \", \"&K24)&"}]
[4,4,4,"4:4","Caribbean",237,219,52,null,"0xEDDB34","\"Caribbean\": 4",null,null,null,null,null,null,null,null,null,4,25,"IF(ISBLANK(E25),\"\",\",\"&E25)&",null,null,"IF(D25=\"\",\"\",\",\"&D25)&",null,"IF(J25=\"\",\"\",\",\"&J25)&",null,null,"IF(K25=\"\",\"\", \", \"&K25)&"]
[5,5,5,"5:5","Central America",39,116,217,null,"0x2774D9","\"Central America\": 5",null,null,null,null,null,null,null,null,null,5,26,"IF(ISBLANK(E26),\"\",\",\"&E26)&",null,null,"IF(D26=\"\",\"\",\",\"&D26)&",null,"IF(J26=\"\",\"\",\",\"&J26)&",null,null,"IF(K26=\"\",\"\", \", \"&K26)&"]
[6,6,6,"6:6","Central Asia",255,255,115,null,"0xFFFF73","\"Central Asia\": 6",null,null,null,null,null,null,null,null,null,6,27,"IF(ISBLANK(E27),\"\",\",\"&E27)&",null,null,"IF(D27=\"\",\"\",\",\"&D27)&",null,"IF(J27=\"\",\"\",\",\"&J27)&",null,null,"IF(K27=\"\",\"\", \", \"&K27)&"]
[7,7,7,"7:7","Eastern Africa",84,242,36,null,"0x54F224","\"Eastern Africa\": 7",null,null,null,null,null,null,null,null,null,7,28,"IF(ISBLANK(E28),\"\",\",\"&E28)&",null,null,"IF(D28=\"\",\"\",\",\"&D28)&",null,"IF(J28=\"\",\"\",\",\"&J28)&",null,null,"IF(K28=\"\",\"\", \", \"&K28)&"]
[8,8,8,"8:8","Eastern Asia",232,37,213,null,"0xE825D5","\"Eastern Asia\": 8",null,null,null,null,null,null,null,null,null,8,29,"IF(ISBLANK(E29),\"\",\",\"&E29)&",null,null,"IF(D29=\"\",\"\",\",\"&D29)&",null,"IF(J29=\"\",\"\",\",\"&J29)&",null,null,"IF(K29=\"\",\"\", \", \"&K29)&"]
[9,9,9,"9:9","Eastern Europe",205,137,102,null,"0xCD8966","\"Eastern Europe\": 9",null,null,null,null,null,null,null,null,null,9,30,"IF(ISBLANK(E30),\"\",\",\"&E30)&",null,null,"IF(D30=\"\",\"\",\",\"&D30)&",null,"IF(J30=\"\",\"\",\",\"&J30)&",null,null,"IF(K30=\"\",\"\", \", \"&K30)&"]
[10,10,10,"10:10","European Russia",169,209,214,null,"0xA9D1D6","\"European Russia\": 10",null,null,null,null,null,null,null,null,null,10,31,"IF(ISBLANK(E31),\"\",\",\"&E31)&",null,null,"IF(D31=\"\",\"\",\",\"&D31)&",null,"IF(J31=\"\",\"\",\",\"&J31)&",null,null,"IF(K31=\"\",\"\", \", \"&K31)&"]
[11,11,11,"11:11","Melanesia",40,13,84,null,"0x280D54","\"Melanesia\": 11",null,null,null,null,null,null,null,null,null,11,32,"IF(ISBLANK(E32),\"\",\",\"&E32)&",null,null,"IF(D32=\"\",\"\",\",\"&D32)&",null,"IF(J32=\"\",\"\",\",\"&J32)&",null,null,"IF(K32=\"\",\"\", \", \"&K32)&"]
[12,12,12,"12:12","Micronesia",219,11,28,null,"0xDB0B1C","\"Micronesia\": 12",null,null,null,null,null,null,null,null,null,12,33,"IF(ISBLANK(E33),\"\",\",\"&E33)&",null,null,"IF(D33=\"\",\"\",\",\"&D33)&",null,"IF(J33=\"\",\"\",\",\"&J33)&",null,null,"IF(K33=\"\",\"\", \", \"&K33)&"]
[13,13,13,"13:13","Middle Africa",140,114,56,null,"0x8C7238","\"Middle Africa\": 13",null,null,null,null,null,null,null,null,null,13,34,"IF(ISBLANK(E34),\"\",\",\"&E34)&",null,null,"IF(D34=\"\",\"\",\",\"&D34)&",null,"IF(J34=\"\",\"\",\",\"&J34)&",null,null,"IF(K34=\"\",\"\", \", \"&K34)&"]
[14,14,14,"14:14","Northern Africa",228,174,252,null,"0xE4AEFC","\"Northern Africa\": 14",null,null,null,null,null,null,null,null,null,14,35,"IF(ISBLANK(E35),\"\",\",\"&E35)&",null,null,"IF(D35=\"\",\"\",\",\"&D35)&",null,"IF(J35=\"\",\"\",\",\"&J35)&",null,null,"IF(K35=\"\",\"\", \", \"&K35)&"]
[15,15,15,"15:15","Northern America",174,219,129,null,"0xAEDB81","\"Northern America\": 15",null,null,null,null,null,null,null,null,null,15,36,"IF(ISBLANK(E36),\"\",\",\"&E36)&",null,null,"IF(D36=\"\",\"\",\",\"&D36)&",null,"IF(J36=\"\",\"\",\",\"&J36)&",null,null,"IF(K36=\"\",\"\", \", \"&K36)&"]
[16,16,16,"16:16","Northern Europe",128,87,230,null,"0x8057E6","\"Northern Europe\": 16",null,null,null,null,null,null,null,null,null,16,37,"IF(ISBLANK(E37),\"\",\",\"&E37)&",null,null,"IF(D37=\"\",\"\",\",\"&D37)&",null,"IF(J37=\"\",\"\",\",\"&J37)&",null,null,"IF(K37=\"\",\"\", \", \"&K37)&"]
[17,17,17,"17:17","Polynesia",19,181,207,null,"0x13B5CF","\"Polynesia\": 17",null,null,null,null,null,null,null,null,null,17,38,"IF(ISBLANK(E38),\"\",\",\"&E38)&",null,null,"IF(D38=\"\",\"\",\",\"&D38)&",null,"IF(J38=\"\",\"\",\",\"&J38)&",null,null,"IF(K38=\"\",\"\", \", \"&K38)&"]
[18,18,18,"18:18","South America",56,168,0,null,"0x38A800","\"South America\": 18",null,null,null,null,null,null,null,null,null,18,39,"IF(ISBLANK(E39),\"\",\",\"&E39)&",null,null,"IF(D39=\"\",\"\",\",\"&D39)&",null,"IF(J39=\"\",\"\",\",\"&J39)&",null,null,"IF(K39=\"\",\"\", \", \"&K39)&"]
[19,19,19,"19:19","Southeastern Asia",102,71,115,null,"0x664773","\"Southeastern Asia\": 19",null,null,null,null,null,null,null,null,null,19,40,"IF(ISBLANK(E40),\"\",\",\"&E40)&",null,null,"IF(D40=\"\",\"\",\",\"&D40)&",null,"IF(J40=\"\",\"\",\",\"&J40)&",null,null,"IF(K40=\"\",\"\", \", \"&K40)&"]
[20,20,20,"20:20","Southern Africa",137,140,136,null,"0x898C88","\"Southern Africa\": 20",null,null,null,null,null,null,null,null,null,20,41,"IF(ISBLANK(E41),\"\",\",\"&E41)&",null,null,"IF(D41=\"\",\"\",\",\"&D41)&",null,"IF(J41=\"\",\"\",\",\"&J41)&",null,null,"IF(K41=\"\",\"\", \", \"&K41)&"]
[21,21,21,"21:21","Southern Asia",112,6,4,null,"0x700604","\"Southern Asia\": 21",null,null,null,null,null,null,null,null,null,21,42,"IF(ISBLANK(E42),\"\",\",\"&E42)&",null,null,"IF(D42=\"\",\"\",\",\"&D42)&",null,"IF(J42=\"\",\"\",\",\"&J42)&",null,null,"IF(K42=\"\",\"\", \", \"&K42)&"]
[22,22,22,"22:22","Southern Europe",239,228,190,null,"0xEFE4BE","\"Southern Europe\": 22",null,null,null,null,null,null,null,null,null,22,43,"IF(ISBLANK(E43),\"\",\",\"&E43)&",null,null,"IF(D43=\"\",\"\",\",\"&D43)&",null,"IF(J43=\"\",\"\",\",\"&J43)&",null,null,"IF(K43=\"\",\"\", \", \"&K43)&"]
[23,23,23,"23:23","Western Africa",245,34,101,null,"0xF52265","\"Western Africa\": 23",null,null,null,null,null,null,null,null,null,23,44,"IF(ISBLANK(E44),\"\",\",\"&E44)&",null,null,"IF(D44=\"\",\"\",\",\"&D44)&",null,"IF(J44=\"\",\"\",\",\"&J44)&",null,null,"IF(K44=\"\",\"\", \", \"&K44)&"]
[24,24,24,"24:24","Western Asia",205,205,102,null,"0xCDCD66","\"Western Asia\": 24",null,null,null,null,null,null,null,null,null,24,45,"IF(ISBLANK(E45),\"\",\",\"&E45)&",null,null,"IF(D45=\"\",\"\",\",\"&D45)&",null,"IF(J45=\"\",\"\",\",\"&J45)&",null,null,"IF(K45=\"\",\"\", \", \"&K45)&"]
[25,25,25,"25:25","Western Europe",224,101,202,null,"0xE065CA","\"Western Europe\": 25",null,null,null,null,null,null,null,null,null,25,46,"IF(ISBLANK(E46),\"\",\",\"&E46)&",null,null,"IF(D46=\"\",\"\",\",\"&D46)&",null,"IF(J46=\"\",\"\",\",\"&J46)&",null,null,"IF(K46=\"\",\"\", \", \"&K46)&"]
[26,null,null,"",null,null,null,null,null,"","",null,null,null,null,null,null,null,null,null,26,47,"IF(ISBLANK(E47),\"\",\",\"&E47)&",null,null,"IF(D47=\"\",\"\",\",\"&D47)&",null,"IF(J47=\"\",\"\",\",\"&J47)&",null,null,"IF(K47=\"\",\"\", \", \"&K47)&"]
[27,null,null,"",null,null,null,null,null,"","",null,null,null,null,null,null,null,null,null,27,48,"IF(ISBLANK(E48),\"\",\",\"&E48)&",null,null,"IF(D48=\"\",\"\",\",\"&D48)&",null,"IF(J48=\"\",\"\",\",\"&J48)&",null,null,"IF(K48=\"\",\"\", \", \"&K48)&"]
[28,null,null,"",null,null,null,null,null,"","",null,null,null,null,null,null,null,null,null,28,49,"IF(ISBLANK(E49),\"\",\",\"&E49)&",null,null,"IF(D49=\"\",\"\",\",\"&D49)&",null,"IF(J49=\"\",\"\",\",\"&J49)&",null,null,"IF(K49=\"\",\"\", \", \"&K49)&"]
[29,null,null,"",null,null,null,null,null,"","",null,null,null,null,null,null,null,null,null,29,50,"IF(ISBLANK(E50),\"\",\",\"&E50)&",null,null,"IF(D50=\"\",\"\",\",\"&D50)&",null,"IF(J50=\"\",\"\",\",\"&J50)&",null,null,"IF(K50=\"\",\"\", \", \"&K50)&"]
[30,null,null,"",null,null,null,null,null,"","",null,null,null,null,null,null,null,null,null,30,51,"IF(ISBLANK(E51),\"\",\",\"&E51)&",null,null,"IF(D51=\"\",\"\",\",\"&D51)&",null,"IF(J51=\"\",\"\",\",\"&J51)&",null,null,"IF(K51=\"\",\"\", \", \"&K51)&"]
[31,null,null,"",null,null,null,null,null,"","",null,null,null,null,null,null,null,null,null,31,52,"IF(ISBLANK(E52),\"\",\",\"&E52)&",null,null,"IF(D52=\"\",\"\",\",\"&D52)&",null,"IF(J52=\"\",\"\",\",\"&J52)&",null,null,"IF(K52=\"\",\"\", \", \"&K52)&"]
[32,null,null,"",null,null,null,null,null,"","",null,null,null,null,null,null,null,null,null,32,53,"IF(ISBLANK(E53),\"\",\",\"&E53)&",null,null,"IF(D53=\"\",\"\",\",\"&D53)&",null,"IF(J53=\"\",\"\",\",\"&J53)&",null,null,"IF(K53=\"\",\"\", \", \"&K53)&"]
[33,null,null,{"$f":"IF($A55<=$B$17,B55&\":\"&C55,\"\")","v":""},null,null,null,null,null,{"$f":"IF($A55<=$B$17,\"0x\"&DEC2HEX(F55,2)&DEC2HEX(G55,2)&DEC2HEX(H55,2),\"\")","v":""},{"$f":"IF($A55<=$B$17,\"\"\"\"&E55&\"\"\": \"&B55,\"\")","v":""},null,null,null,null,null,null,null,null,null,33,54,"IF(ISBLANK(E54),\"\",\",\"&E54)&",null,null,"IF(D54=\"\",\"\",\",\"&D54)&",null,"IF(J54=\"\",\"\",\",\"&J54)&",null,null,"IF(K54=\"\",\"\", \", \"&K54)&"]
[34,null,null,"",null,null,null,null,null,"","",null,null,null,null,null,null,null,null,null,34,55,{"$f":"\"IF(ISBLANK(E\"&V56&\"),\"\"\"\",\"\",\"&\"\"\"&E\"&V56&\")&\"","v":"IF(ISBLANK(E55),\"\",\",\"&E55)&"},null,null,"IF(D55=\"\",\"\",\",\"&D55)&",null,{"$f":"\"IF(J\"&V56&\"=\"\"\"\",\"\"\"\",\"\",\"&\"\"\"&J\"&V56&\")&\"","v":"IF(J55=\"\",\"\",\",\"&J55)&"},null,null,"IF(K55=\"\",\"\", \", \"&K55)&"]
[35,null,null,"",null,null,null,null,null,"","",null,null,null,null,null,null,null,null,null,35,56,"IF(ISBLANK(E56),\"\",\",\"&E56)&",null,null,"IF(D56=\"\",\"\",\",\"&D56)&",null,"IF(J56=\"\",\"\",\",\"&J56)&",null,null,"IF(K56=\"\",\"\", \", \"&K56)&"]
[36,null,null,"",null,null,null,null,null,"","",null,null,null,null,null,null,null,null,null,36,57,"IF(ISBLANK(E57),\"\",\",\"&E57)&",null,null,"IF(D57=\"\",\"\",\",\"&D57)&",null,"IF(J57=\"\",\"\",\",\"&J57)&",null,null,"IF(K57=\"\",\"\", \", \"&K57)&"]
[37,null,null,"",null,null,null,null,null,"","",null,null,null,null,null,null,null,null,null,37,58,"IF(ISBLANK(E58),\"\",\",\"&E58)&",null,null,"IF(D58=\"\",\"\",\",\"&D58)&",null,"IF(J58=\"\",\"\",\",\"&J58)&",null,null,"IF(K58=\"\",\"\", \", \"&K58)&"]
[38,null,null,"",null,null,null,null,null,"","",null,null,null,null,null,null,null,null,null,38,59,"IF(ISBLANK(E59),\"\",\",\"&E59)&",null,null,"IF(D59=\"\",\"\",\",\"&D59)&",null,"IF(J59=\"\",\"\",\",\"&J59)&",null,null,"IF(K59=\"\",\"\", \", \"&K59)&"]
[39,null,null,"",null,null,null,null,null,"","",null,null,null,null,null,null,null,null,null,39,60,"IF(ISBLANK(E60),\"\",\",\"&E60)&",null,null,"IF(D60=\"\",\"\",\",\"&D60)&",null,"IF(J60=\"\",\"\",\",\"&J60)&",null,null,"IF(K60=\"\",\"\", \", \"&K60)&"]
[40,null,null,"",null,null,null,null,null,"","",null,null,null,null,null,null,null,null,null,40,61,"IF(ISBLANK(E61),\"\",\",\"&E61)&",null,null,"IF(D61=\"\",\"\",\",\"&D61)&",null,"IF(J61=\"\",\"\",\",\"&J61)&",null,null,"IF(K61=\"\",\"\", \", \"&K61)&"]
[41,null,null,"",null,null,null,null,null,"","",null,null,null,null,null,null,null,null,null,41,62,"IF(ISBLANK(E62),\"\",\",\"&E62)&",null,null,"IF(D62=\"\",\"\",\",\"&D62)&",null,"IF(J62=\"\",\"\",\",\"&J62)&",null,null,"IF(K62=\"\",\"\", \", \"&K62)&"]
[42,null,null,"",null,null,null,null,null,"","",null,null,null,null,null,null,null,null,null,42,63,"IF(ISBLANK(E63),\"\",\",\"&E63)&",null,null,"IF(D63=\"\",\"\",\",\"&D63)&",null,"IF(J63=\"\",\"\",\",\"&J63)&",null,null,"IF(K63=\"\",\"\", \", \"&K63)&"]
[43,null,null,"",null,null,null,null,null,"","",null,null,null,null,null,null,null,null,null,43,64,"IF(ISBLANK(E64),\"\",\",\"&E64)&",null,null,"IF(D64=\"\",\"\",\",\"&D64)&",null,"IF(J64=\"\",\"\",\",\"&J64)&",null,null,"IF(K64=\"\",\"\", \", \"&K64)&"]
[44,null,null,"",null,null,null,null,null,"","",null,null,null,null,null,null,null,null,null,44,65,"IF(ISBLANK(E65),\"\",\",\"&E65)&",null,null,"IF(D65=\"\",\"\",\",\"&D65)&",null,"IF(J65=\"\",\"\",\",\"&J65)&",null,null,"IF(K65=\"\",\"\", \", \"&K65)&"]
[45,null,null,"",null,null,null,null,null,"","",null,null,null,null,null,null,null,null,null,45,66,"IF(ISBLANK(E66),\"\",\",\"&E66)&",null,null,"IF(D66=\"\",\"\",\",\"&D66)&",null,"IF(J66=\"\",\"\",\",\"&J66)&",null,null,"IF(K66=\"\",\"\", \", \"&K66)&"]
[46,null,null,"",null,null,null,null,null,"","",null,null,null,null,null,null,null,null,null,46,67,"IF(ISBLANK(E67),\"\",\",\"&E67)&",null,null,"IF(D67=\"\",\"\",\",\"&D67)&",null,"IF(J67=\"\",\"\",\",\"&J67)&",null,null,"IF(K67=\"\",\"\", \", \"&K67)&"]
[47,null,null,"",null,null,null,null,null,"","",null,null,null,null,null,null,null,null,null,47,68,"IF(ISBLANK(E68),\"\",\",\"&E68)&",null,null,"IF(D68=\"\",\"\",\",\"&D68)&",null,"IF(J68=\"\",\"\",\",\"&J68)&",null,null,"IF(K68=\"\",\"\", \", \"&K68)&"]
[48,null,null,"",null,null,null,null,null,"","",null,null,null,null,null,null,null,null,null,48,69,"IF(ISBLANK(E69),\"\",\",\"&E69)&",null,null,"IF(D69=\"\",\"\",\",\"&D69)&",null,"IF(J69=\"\",\"\",\",\"&J69)&",null,null,"IF(K69=\"\",\"\", \", \"&K69)&"]
[49,null,null,"",null,null,null,null,null,"","",null,null,null,null,null,null,null,null,null,49,70,"IF(ISBLANK(E70),\"\",\",\"&E70)&",null,null,"IF(D70=\"\",\"\",\",\"&D70)&",null,"IF(J70=\"\",\"\",\",\"&J70)&",null,null,"IF(K70=\"\",\"\", \", \"&K70)&"]
[50,null,null,"",null,null,null,null,null,"","",null,null,null,null,null,null,null,null,null,50,71,"IF(ISBLANK(E71),\"\",\",\"&E71)&",null,null,"IF(D71=\"\",\"\",\",\"&D71)&",null,"IF(J71=\"\",\"\",\",\"&J71)&",null,null,"IF(K71=\"\",\"\", \", \"&K71)&"]

{"sheet":"Example_legends","index":2,"n_rows":219,"n_cols":31,"rows_kept":219,"cut":false,"hidden":false,"merged":[]}
["Examples of MAP LEGENDs for GLOBAL VARIABLEs"]
["Create a standard map legend for viewing the variable in GLOBE"]
[null,null,null,null,null,null,null,null,null,null,null,null,null,null,null,null,null,null,null,null,null,null,null,null,null,null,null,null,null,null,{"$f":"#REF!&#REF!&#REF!&#REF!&#REF!&#REF!&#REF!&#REF!&#REF!&#REF!&#REF!&#REF!&#REF!&#REF!&#REF!&#REF!&#REF!&#REF!&#REF!&#REF!&#REF!&#REF!&#REF!&#REF!&#REF!&#REF!&#REF!&#REF!&#REF!&#REF!&#REF!&#REF!&#REF!&#REF!&#REF!&#REF!&#REF!&#REF!&#REF!&#REF!&#REF!&#REF!&#REF!&#REF!&#REF!&#REF!&#REF!&#REF!&#REF!&#REF!","v":{"$error":"#REF!"}}]
["EXAMPLE LEGENDS"]
[]
["ESRI 25 World Regions"]
[]
["#","LOW","HIGH","RANGE","LABEL","R","G","B","COLOR","HEX","CATEGORIES"]
[1,1,1,{"$f":"B9&\":\"&C9","v":"1:1"},"Antarctica",225,225,225,null,{"$f":"\"0x\"&DEC2HEX(F9,2)&DEC2HEX(G9,2)&DEC2HEX(H9,2)","v":"0xE1E1E1"},{"$f":"\"\"\"\"&E9&\"\"\": \"&B9","v":"\"Antarctica\": 1"}]
[2,2,2,"2:2","Asiatic Russia",7,222,164,null,"0x07DEA4",{"$f":"\"\"\"\"&E10&\"\"\": \"&B10","v":"\"Asiatic Russia\": 2"}]
[3,3,3,"3:3","Australia/New Zealand",40,22,240,null,"0x2816F0","\"Australia/New Zealand\": 3"]
[4,4,4,"4:4","Caribbean",237,219,52,null,"0xEDDB34","\"Caribbean\": 4"]
[5,5,5,"5:5","Central America",39,116,217,null,"0x2774D9","\"Central America\": 5"]
[6,6,6,"6:6","Central Asia",255,255,115,null,"0xFFFF73","\"Central Asia\": 6"]
[7,7,7,"7:7","Eastern Africa",84,242,36,null,"0x54F224","\"Eastern Africa\": 7"]
[8,8,8,"8:8","Eastern Asia",232,37,213,null,"0xE825D5","\"Eastern Asia\": 8"]
[9,9,9,"9:9","Eastern Europe",205,137,102,null,"0xCD8966","\"Eastern Europe\": 9"]
[10,10,10,"10:10","European Russia",169,209,214,null,"0xA9D1D6","\"European Russia\": 10"]
[11,11,11,"11:11","Melanesia",40,13,84,null,"0x280D54","\"Melanesia\": 11"]
[12,12,12,"12:12","Micronesia",219,11,28,null,"0xDB0B1C","\"Micronesia\": 12"]
[13,13,13,"13:13","Middle Africa",140,114,56,null,"0x8C7238","\"Middle Africa\": 13"]
[14,14,14,"14:14","Northern Africa",228,174,252,null,"0xE4AEFC","\"Northern Africa\": 14"]
[15,15,15,"15:15","Northern America",174,219,129,null,"0xAEDB81","\"Northern America\": 15"]
[16,16,16,"16:16","Northern Europe",128,87,230,null,"0x8057E6","\"Northern Europe\": 16"]
[17,17,17,"17:17","Polynesia",19,181,207,null,"0x13B5CF","\"Polynesia\": 17"]
[18,18,18,"18:18","South America",56,168,0,null,"0x38A800","\"South America\": 18"]
[19,19,19,"19:19","Southeastern Asia",102,71,115,null,"0x664773","\"Southeastern Asia\": 19"]
[20,20,20,"20:20","Southern Africa",137,140,136,null,"0x898C88","\"Southern Africa\": 20"]
[21,21,21,"21:21","Southern Asia",112,6,4,null,"0x700604","\"Southern Asia\": 21"]
[22,22,22,"22:22","Southern Europe",239,228,190,null,"0xEFE4BE","\"Southern Europe\": 22"]
[23,23,23,"23:23","Western Africa",245,34,101,null,"0xF52265","\"Western Africa\": 23"]
[24,24,24,"24:24","Western Asia",205,205,102,null,"0xCDCD66","\"Western Asia\": 24"]
[25,25,25,"25:25","Western Europe",224,101,202,null,"0xE065CA","\"Western Europe\": 25"]
[]
[]
[]
[]
["Forest cover loss (2000 to 2005)"]
[]
["#","LOW","HIGH","RANGE","LABEL","R","G","B","COLOR","HEX","CATEGORIES"]
[1,0,0,"0:0","non-forest",255,255,255,null,"0xFFFFFF","\"non-forest\": 0"]
[2,0,0.5,"0:0.5","0 to 0.5%",33,130,145,null,"0x218291","\"0 to 0.5%\": 0"]
[3,0.5,1,"0.5:1","0.5 to 1%",92,158,156,null,"0x5C9E9C","\"0.5 to 1%\": 0.5"]
[4,1,2,"1:2","1 to 2%",145,189,168,null,"0x91BDA8","\"1 to 2%\": 1"]
[5,2,5,"2:5","2 to 5%",199,222,180,null,"0xC7DEB4","\"2 to 5%\": 2"]
[6,5,10,"5:10","5 to 10%",255,255,191,null,"0xFFFFBF","\"5 to 10%\": 5"]
[7,10,25,"10:25","10 to 25%",232,207,144,null,"0xE8CF90","\"10 to 25%\": 10"]
[8,25,50,"25:50","25 to 50%",207,162,99,null,"0xCFA263","\"25 to 50%\": 25"]
[9,50,75,"50:75","50 to 75%",181,119,62,null,"0xB5773E","\"50 to 75%\": 50"]
[10,75,100,"75:100","75 to 100%",156,85,31,null,"0x9C551F","\"75 to 100%\": 75"]
[]
[]
[]
[]
["Biogeographic Realms"]
[]
["#","LOW","HIGH","RANGE","LABEL","R","G","B","COLOR","HEX","CATEGORIES"]
[1,1,1,{"$f":"IF($A58<=$B$16,B58&\":\"&C58,\"\")","v":"1:1"},"Australasia",255,211,127,null,{"$f":"IF($A58<=$B$16,\"0x\"&DEC2HEX(F58,2)&DEC2HEX(G58,2)&DEC2HEX(H58,2),\"\")","v":"0xFFD37F"},{"$f":"IF($A58<=$B$16,\"\"\"\"&E58&\"\"\": \"&B58,\"\")","v":"\"Australasia\": 1"}]
[2,2,2,"2:2","Antarctic",225,225,225,null,"0xE1E1E1","\"Antarctic\": 2"]
[3,3,3,"3:3","Afrotropic",102,194,165,null,"0x66C2A5","\"Afrotropic\": 3"]
[4,4,4,"4:4","Indo-Malay",209,255,115,null,"0xD1FF73","\"Indo-Malay\": 4"]
[5,5,5,"5:5","Nearctic",26,240,51,null,"0x1AF033","\"Nearctic\": 5"]
[6,6,6,"6:6","Neotropic",219,212,13,null,"0xDBD40D","\"Neotropic\": 6"]
[7,7,7,"7:7","Oceania",115,178,255,null,"0x73B2FF","\"Oceania\": 7"]
[8,8,8,"8:8","Palearctic",222,153,207,null,"0xDE99CF","\"Palearctic\": 8"]
[]
[]
[]
[]
["Anthromes (v2)"]
[]
["#","LOW","HIGH","RANGE","LABEL","R","G","B","COLOR","HEX","CATEGORIES"]
[1,11,11,"11:11","11: Urban",168,0,0,null,"0xA80000","\"11: Urban\": 11"]
[2,12,12,"12:12","12: Dense settlements",255,0,0,null,"0xFF0000","\"12: Dense settlements\": 12"]
[3,21,21,"21:21","21: Rice villages",0,112,255,null,"0x0070FF","\"21: Rice villages\": 21"]
[4,22,22,"22:22","22: Irrigated villages",0,169,230,null,"0x00A9E6","\"22: Irrigated villages\": 22"]
[5,23,23,"23:23","23: Rainfed villages",169,0,230,null,"0xA900E6","\"23: Rainfed villages\": 23"]
[6,24,24,"24:24","24: Pastoral villages",255,115,223,null,"0xFF73DF","\"24: Pastoral villages\": 24"]
[7,31,31,"31:31","31: Residential irrigated croplands",0,255,197,null,"0x00FFC5","\"31: Residential irrigated croplands\": 31"]
[8,32,32,"32:32","32: Residential rainfed croplands",230,230,0,null,"0xE6E600","\"32: Residential rainfed croplands\": 32"]
[9,33,33,"33:33","33: Populated croplands",255,255,115,null,"0xFFFF73","\"33: Populated croplands\": 33"]
[10,34,34,"34:34","34: Remote croplands",255,255,190,null,"0xFFFFBE","\"34: Remote croplands\": 34"]
[11,41,41,"41:41","41: Residential rangelands",230,152,0,null,"0xE69800","\"41: Residential rangelands\": 41"]
[12,42,42,"42:42","42: Populated rangelands",255,211,127,null,"0xFFD37F","\"42: Populated rangelands\": 42"]
[13,43,43,"43:43","43: Remote rangelands",255,235,175,null,"0xFFEBAF","\"43: Remote rangelands\": 43"]
[14,51,51,"51:51","51: Residential woodlands",56,168,0,null,"0x38A800","\"51: Residential woodlands\": 51"]
[15,52,52,"52:52","52: Populated woodlands",165,245,122,null,"0xA5F57A","\"52: Populated woodlands\": 52"]
[16,53,53,"53:53","53: Remote woodlands",211,255,178,null,"0xD3FFB2","\"53: Remote woodlands\": 53"]
[17,54,54,"54:54","54: Inhabited treeless and barren lands",178,178,178,null,"0xB2B2B2","\"54: Inhabited treeless and barren lands\": 54"]
[18,61,61,"61:61","61: Wild woodlands",218,242,234,null,"0xDAF2EA","\"61: Wild woodlands\": 61"]
[19,62,62,"62:62","62: Wild treeless and barren lands",225,225,225,null,"0xE1E1E1","\"62: Wild treeless and barren lands\": 62"]
[]
[]
[]
[]
["Precipitation"]
[]
["#","LOW","HIGH","RANGE","LABEL","R","G","B","COLOR","HEX","CATEGORIES"]
[1,0,50,"0:50","0",84,48,5,null,"0x543005","\"0\": 0"]
[2,50,100,"50:100","50 to 100",140,81,10,null,"0x8C510A","\"50 to 100\": 50"]
[3,100,250,"100:250","100 to 250",191,129,45,null,"0xBF812D","\"100 to 250\": 100"]
[4,250,500,"250:500","250 to 500",223,194,125,null,"0xDFC27D","\"250 to 500\": 250"]
[5,500,750,"500:750","500 to 750",246,232,195,null,"0xF6E8C3","\"500 to 750\": 500"]
[6,750,1000,"750:1000","750 to 1000",245,245,245,null,"0xF5F5F5","\"750 to 1000\": 750"]
[7,1000,1250,"1000:1250","1000 to 1250",199,234,229,null,"0xC7EAE5","\"1000 to 1250\": 1000"]
[8,1250,1500,"1250:1500","1250 to 1500",128,205,193,null,"0x80CDC1","\"1250 to 1500\": 1250"]
[9,1500,2000,"1500:2000","1500 to 2000",53,151,143,null,"0x35978F","\"1500 to 2000\": 1500"]
[10,2000,3000,"2000:3000","2000 to 3000",1,102,94,null,"0x01665E","\"2000 to 3000\": 2000"]
[11,3000,11000,"3000:11000","3000 to 11000",0,60,48,null,"0x003C30","\"3000 to 11000\": 3000"]
[]
[]
[]
["% Tree Cover (2001 VCF)"]
[]
["#","LOW","HIGH","RANGE","LABEL","R","G","B","COLOR","HEX","CATEGORIES"]
[1,0,0,{"$f":"B116&\":\"&C116","v":"0:0"},"0",224,224,224,null,{"$f":"\"0x\"&DEC2HEX(F116,2)&DEC2HEX(G116,2)&DEC2HEX(H116,2)","v":"0xE0E0E0"},{"$f":"\"\"\"\"&E116&\"\"\": \"&B116","v":"\"0\": 0"}]
[2,0,1,"0:1","0 to 1",255,255,229,null,{"$f":"\"0x\"&DEC2HEX(F117,2)&DEC2HEX(G117,2)&DEC2HEX(H117,2)","v":"0xFFFFE5"},{"$f":"\"\"\"\"&E117&\"\"\": \"&B117","v":"\"0 to 1\": 0"}]
[3,1,5,"1:5","1 to 5",247,252,185,null,"0xF7FCB9","\"1 to 5\": 1"]
[4,5,10,"5:10","5 to 10",217,240,163,null,"0xD9F0A3","\"5 to 10\": 5"]
[5,10,20,"10:20","10 to 20",173,221,142,null,"0xADDD8E","\"10 to 20\": 10"]
[6,20,30,"20:30","20 to 30",120,198,121,null,"0x78C679","\"20 to 30\": 20"]
[7,30,40,"30:40","30 to 40",65,171,93,null,"0x41AB5D","\"30 to 40\": 30"]
[8,40,50,"40:50","40 to 50",35,132,67,null,"0x238443","\"40 to 50\": 40"]
[9,50,60,"50:60","50 to 60",0,104,55,null,"0x006837","\"50 to 60\": 50"]
[10,60,75,"60:75","60 to 75",0,69,41,null,"0x004529","\"60 to 75\": 60"]
[11,75,100,"75:100","75 to 100",1,70,54,null,"0x014636","\"75 to 100\": 75"]
[]
[]
[]
[]
["Potential Vegetation Biomes (POTVEG)"]
[]
["#","LOW","HIGH","RANGE","LABEL","R","G","B","COLOR","HEX","CATEGORIES"]
[1,0,0,"0:0","No Data",0,0,0,null,"0x000000","\"No Data\": 0"]
[2,1,1,"1:1","Tropical Evergreen Woodland",38,115,0,null,"0x267300","\"Tropical Evergreen Woodland\": 1"]
[3,2,2,"2:2","Tropical Deciduous Woodland",76,230,0,null,"0x4CE600","\"Tropical Deciduous Woodland\": 2"]
[4,3,3,"3:3","Temperate Evergreen Woodland",112,168,0,null,"0x70A800","\"Temperate Evergreen Woodland\": 3"]
[5,4,4,"4:4","Temperate Deciduous Woodland",170,255,0,null,"0xAAFF00","\"Temperate Deciduous Woodland\": 4"]
[6,5,5,"5:5","Boreal Woodland",68,137,112,null,"0x448970","\"Boreal Woodland\": 5"]
[7,6,6,"6:6","Mixed Woodland",102,205,171,null,"0x66CDAB","\"Mixed Woodland\": 6"]
[8,7,7,"7:7","Savanna",171,205,102,null,"0xABCD66","\"Savanna\": 7"]
[9,8,8,"8:8","Grassland and Steppe",233,255,190,null,"0xE9FFBE","\"Grassland and Steppe\": 8"]
[10,9,9,"9:9","Dense Shrubland",171,205,102,null,"0xABCD66","\"Dense Shrubland\": 9"]
[11,10,10,"10:10","Open Shrubland",215,215,158,null,"0xD7D79E","\"Open Shrubland\": 10"]
[12,11,11,"11:11","Tundra",226,255,224,null,"0xE2FFE0","\"Tundra\": 11"]
[13,12,12,"12:12","Deserts and Barren",225,225,225,null,"0xE1E1E1","\"Deserts and Barren\": 12"]
[]
[]
[]
[]
["Human Population Density (Landscan 2007)"]
[]
["#","LOW","HIGH","RANGE","LABEL","R","G","B","COLOR","HEX","CATEGORIES"]
[1,0,0,{"$f":"B154&\":\"&C154","v":"0:0"},"0",204,204,204,null,{"$f":"\"0x\"&DEC2HEX(F154,2)&DEC2HEX(G154,2)&DEC2HEX(H154,2)","v":"0xCCCCCC"},{"$f":"\"\"\"\"&E154&\"\"\": \"&B154","v":"\"0\": 0"}]
[2,0,1,{"$f":"B155&\":\"&C155","v":"0:1"},"0 to 1",255,247,236,null,{"$f":"\"0x\"&DEC2HEX(F155,2)&DEC2HEX(G155,2)&DEC2HEX(H155,2)","v":"0xFFF7EC"},{"$f":"\"\"\"\"&E155&\"\"\": \"&B155","v":"\"0 to 1\": 0"}]
[3,1,5,"1:5","1 to 5",255,255,204,null,"0xFFFFCC","\"1 to 5\": 1"]
[4,5,10,"5:10","5 to 10",255,237,160,null,"0xFFEDA0","\"5 to 10\": 5"]
[5,10,25,"10:25","10 to 25",254,217,118,null,"0xFED976","\"10 to 25\": 10"]
[6,25,50,"25:50","25 to 50",254,178,76,null,"0xFEB24C","\"25 to 50\": 25"]
[7,50,100,"50:100","50 to 100",253,141,60,null,"0xFD8D3C","\"50 to 100\": 50"]
[8,100,500,"100:500","100 to 500",252,78,42,null,"0xFC4E2A","\"100 to 500\": 100"]
[9,500,1000,"500:1000","500 to 1000",227,26,28,null,"0xE31A1C","\"500 to 1000\": 500"]
[10,1000,2500,"1000:2500","1000 to 2500",189,0,38,null,"0xBD0026","\"1000 to 2500\": 1000"]
[11,2500,5000,"2500:5000","2500 to 5000",128,0,38,null,"0x800026","\"2500 to 5000\": 2500"]
[12,5000,50000,"5000:50000","5000 to 50000",103,0,31,null,"0x67001F","\"5000 to 50000\": 5000"]
[]
[]
[]
[]
["Soil Suitablity"]
[]
["#","LOW","HIGH","RANGE","LABEL","R","G","B","COLOR","HEX"]
[1,0,0,"0:0","NoData/Water",255,255,255,null,"0xFFFFFF"]
[2,2,2,"2:2","No Constraints",0,109,44,null,"0x006D2C"]
[3,3,3,"3:3","Very Few Constraints",204,236,230,null,"0xCCECE6"]
[4,4,4,"4:4","Few Constraints",217,240,163,null,"0xD9F0A3"]
[5,5,5,"5:5","Partly with Constraints",255,255,178,null,"0xFFFFB2"]
[6,6,6,"6:6","Frequent Severe Constraints",205,133,63,null,"0xCD853F"]
[7,7,7,"7:7","Very Frequent Severe Constraints",204,204,204,null,"0xCCCCCC"]
[8,8,8,"8:8","Unsuitable for Agriculture",224,224,224,null,"0xE0E0E0"]
[]
[]
[]
[]
["Elevation"]
[]
["#","LOW","HIGH","RANGE","LABEL","R","G","B","COLOR","HEX","CATEGORIES"]
[1,-413,0,"-413:0","-413 to 0",175,240,233,null,"0xAFF0E9","\"-413 to 0\": -413"]
[2,0,10,"0:10","0 to 10",177,242,207,null,"0xB1F2CF","\"0 to 10\": 0"]
[3,10,25,"10:25","10 to 25",176,245,179,null,"0xB0F5B3","\"10 to 25\": 10"]
[4,25,50,"25:50","25 to 50",206,250,177,null,"0xCEFAB1","\"25 to 50\": 25"]
[5,50,75,"50:75","50 to 75",240,252,179,null,"0xF0FCB3","\"50 to 75\": 50"]
[6,75,100,"75:100","75 to 100",222,237,147,null,"0xDEED93","\"75 to 100\": 75"]
[7,100,200,"100:200","100 to 200",151,209,96,null,"0x97D160","\"100 to 200\": 100"]
[8,200,300,"200:300","200 to 300",73,181,54,null,"0x49B536","\"200 to 300\": 200"]
[9,300,400,"300:400","300 to 400",21,150,47,null,"0x15962F","\"300 to 400\": 300"]
[10,400,500,"400:500","400 to 500",18,130,63,null,"0x12823F","\"400 to 500\": 400"]
[11,500,750,"500:750","500 to 750",82,143,56,null,"0x528F38","\"500 to 750\": 500"]
[12,750,1000,"750:1000","750 to 1000",134,158,46,null,"0x869E2E","\"750 to 1000\": 750"]
[13,1000,1250,"1000:1250","1000 to 1250",184,171,35,null,"0xB8AB23","\"1000 to 1250\": 1000"]
[14,1250,1500,"1250:1500","1250 to 1500",237,181,14,null,"0xEDB50E","\"1250 to 1500\": 1250"]
[15,1500,1750,"1500:1750","1500 to 1750",232,144,2,null,"0xE89002","\"1500 to 1750\": 1500"]
[16,1750,2000,"1750:2000","1750 to 2000",204,93,2,null,"0xCC5D02","\"1750 to 2000\": 1750"]
[17,2000,2250,"2000:2250","2000 to 2250",176,51,2,null,"0xB03302","\"2000 to 2250\": 2000"]
[18,2250,2500,"2250:2500","2250 to 2500",145,18,1,null,"0x911201","\"2250 to 2500\": 2250"]
[19,2500,2750,"2500:2750","2500 to 2750",120,9,1,null,"0x780901","\"2500 to 2750\": 2500"]
[20,2750,3000,"2750:3000","2750 to 3000",115,23,5,null,"0x731705","\"2750 to 3000\": 2750"]
[21,3000,3250,"3000:3250","3000 to 3250",112,31,7,null,"0x701F07","\"3000 to 3250\": 3000"]
[22,3250,3500,"3250:3500","3250 to 3500",110,40,10,null,"0x6E280A","\"3250 to 3500\": 3250"]
[23,3500,3750,"3500:3750","3500 to 3750",105,46,13,null,"0x692E0D","\"3500 to 3750\": 3500"]
[24,3750,4000,"3750:4000","3750 to 4000",120,67,35,null,"0x784323","\"3750 to 4000\": 3750"]
[25,4000,4250,"4000:4250","4000 to 4250",138,94,66,null,"0x8A5E42","\"4000 to 4250\": 4000"]
[26,4250,4500,"4250:4500","4250 to 4500",150,119,101,null,"0x967765","\"4250 to 4500\": 4250"]
[27,4500,4750,"4500:4750","4500 to 4750",166,153,146,null,"0xA69992","\"4500 to 4750\": 4500"]
[28,4750,5000,"4750:5000","4750 to 5000",176,176,176,null,"0xB0B0B0","\"4750 to 5000\": 4750"]
[29,5000,5250,"5000:5250","5000 to 5250",196,196,196,null,"0xC4C4C4","\"5000 to 5250\": 5000"]
[30,5250,5500,"5250:5500","5250 to 5500",214,212,214,null,"0xD6D4D6","\"5250 to 5500\": 5250"]
[31,5500,6000,"5500:6000","5500 to 6000",235,232,235,null,"0xEBE8EB","\"5500 to 6000\": 5500"]
[32,6000,6568,"6000:6568","6000 to 6568",255,252,255,null,"0xFFFCFF","\"6000 to 6568\": 6000"]

{"sheet":"ColorBrewer","index":3,"n_rows":1722,"n_cols":17,"rows_kept":1722,"cut":false,"hidden":false,"merged":[]}
["ColorName","NumOfColors","Type","CritVal","ColorNum","ColorLetter","R","G","B",null,"ColorPatch"]
["YlGn",3,"seq",null,1,"C",247,252,185,null,null,null,"18 Sequential Schemes"]
[null,null,null,null,2,"F",173,221,142,null,null,null,"followed by 9 Diverging and 8 Qualitative"]
[null,null,null,null,3,"I",49,163,84]
["YlGn",4,"seq",null,1,"B",255,255,204]
[null,null,null,null,2,"E",194,230,153]
[null,null,null,null,3,"G",120,198,121]
[null,null,null,null,4,"J",35,132,67]
["YlGn",5,"seq",null,1,"B",255,255,204]
[null,null,null,null,2,"E",194,230,153]
[null,null,null,null,3,"G",120,198,121]
[null,null,null,null,4,"I",49,163,84]
[null,null,null,null,5,"K",0,104,55]
["YlGn",6,"seq",null,1,"B",255,255,204]
[null,null,null,null,2,"D",217,240,163]
[null,null,null,null,3,"F",173,221,142]
[null,null,null,null,4,"G",120,198,121]
[null,null,null,null,5,"I",49,163,84]
[null,null,null,null,6,"K",0,104,55]
["YlGn",7,"seq",null,1,"B",255,255,204]
[null,null,null,null,2,"D",217,240,163]
[null,null,null,null,3,"F",173,221,142]
[null,null,null,null,4,"G",120,198,121]
[null,null,null,null,5,"H",65,171,93]
[null,null,null,null,6,"J",35,132,67]
[null,null,null,null,7,"L",0,90,50]
["YlGn",8,"seq",null,1,"A",255,255,229]
[null,null,null,null,2,"C",247,252,185]
[null,null,null,null,3,"D",217,240,163]
[null,null,null,null,4,"F",173,221,142]
[null,null,null,null,5,"G",120,198,121]
[null,null,null,null,6,"H",65,171,93]
[null,null,null,null,7,"J",35,132,67]
[null,null,null,null,8,"L",0,90,50]
["YlGn",9,"seq",null,1,"A",255,255,229]
[null,null,null,null,2,"C",247,252,185]
[null,null,null,null,3,"D",217,240,163]
[null,null,null,null,4,"F",173,221,142]
[null,null,null,null,5,"G",120,198,121]
[null,null,null,null,6,"H",65,171,93]
[null,null,null,null,7,"J",35,132,67]
[null,null,null,null,8,"K",0,104,55]
[null,null,null,null,9,"M",0,69,41]
["YlGnBu",3,"seq",null,1,"C",237,248,177]
[null,null,null,null,2,"F",127,205,187]
[null,null,null,null,3,"I",44,127,184]
["YlGnBu",4,"seq",null,1,"B",255,255,204]
[null,null,null,null,2,"E",161,218,180]
[null,null,null,null,3,"G",65,182,196]
[null,null,null,null,4,"J",34,94,168]
["YlGnBu",5,"seq",null,1,"B",255,255,204]
[null,null,null,null,2,"E",161,218,180]
[null,null,null,null,3,"G",65,182,196]
[null,null,null,null,4,"I",44,127,184]
[null,null,null,null,5,"K",37,52,148]
["YlGnBu",6,"seq",null,1,"B",255,255,204]
[null,null,null,null,2,"D",199,233,180]
[null,null,null,null,3,"F",127,205,187]
[null,null,null,null,4,"G",65,182,196]
[null,null,null,null,5,"I",44,127,184]
[null,null,null,null,6,"K",37,52,148]
["YlGnBu",7,"seq",null,1,"B",255,255,204]
[null,null,null,null,2,"D",199,233,180]
[null,null,null,null,3,"F",127,205,187]
[null,null,null,null,4,"G",65,182,196]
[null,null,null,null,5,"H",29,145,192]
[null,null,null,null,6,"J",34,94,168]
[null,null,null,null,7,"L",12,44,132]
["YlGnBu",8,"seq",null,1,"A",255,255,217]
[null,null,null,null,2,"C",237,248,177]
[null,null,null,null,3,"D",199,233,180]
[null,null,null,null,4,"F",127,205,187]
[null,null,null,null,5,"G",65,182,196]
[null,null,null,null,6,"H",29,145,192]
[null,null,null,null,7,"J",34,94,168]
[null,null,null,null,8,"L",12,44,132]
["YlGnBu",9,"seq",null,1,"A",255,255,217]
[null,null,null,null,2,"C",237,248,177]
[null,null,null,null,3,"D",199,233,180]
[null,null,null,null,4,"F",127,205,187]
[null,null,null,null,5,"G",65,182,196]
[null,null,null,null,6,"H",29,145,192]
[null,null,null,null,7,"J",34,94,168]
[null,null,null,null,8,"K",37,52,148]
[null,null,null,null,9,"M",8,29,88]
["GnBu",3,"seq",null,1,"C",224,243,219]
[null,null,null,null,2,"F",168,221,181]
[null,null,null,null,3,"I",67,162,202]
["GnBu",4,"seq",null,1,"B",240,249,232]
[null,null,null,null,2,"E",186,228,188]
[null,null,null,null,3,"G",123,204,196]
[null,null,null,null,4,"J",43,140,190]
["GnBu",5,"seq",null,1,"B",240,249,232]
[null,null,null,null,2,"E",186,228,188]
[null,null,null,null,3,"G",123,204,196]
[null,null,null,null,4,"I",67,162,202]
[null,null,null,null,5,"K",8,104,172]
["GnBu",6,"seq",null,1,"B",240,249,232]
[null,null,null,null,2,"D",204,235,197]
[null,null,null,null,3,"F",168,221,181]
[null,null,null,null,4,"G",123,204,196]
[null,null,null,null,5,"I",67,162,202]
[null,null,null,null,6,"K",8,104,172]
["GnBu",7,"seq",null,1,"B",240,249,232]
[null,null,null,null,2,"D",204,235,197]
[null,null,null,null,3,"F",168,221,181]
[null,null,null,null,4,"G",123,204,196]
[null,null,null,null,5,"H",78,179,211]
[null,null,null,null,6,"J",43,140,190]
[null,null,null,null,7,"L",8,88,158]
["GnBu",8,"seq",null,1,"A",247,252,240]
[null,null,null,null,2,"C",224,243,219]
[null,null,null,null,3,"D",204,235,197]
[null,null,null,null,4,"F",168,221,181]
[null,null,null,null,5,"G",123,204,196]
[null,null,null,null,6,"H",78,179,211]
[null,null,null,null,7,"J",43,140,190]
[null,null,null,null,8,"L",8,88,158]
["GnBu",9,"seq",null,1,"A",247,252,240]
[null,null,null,null,2,"C",224,243,219]
[null,null,null,null,3,"D",204,235,197]
[null,null,null,null,4,"F",168,221,181]
[null,null,null,null,5,"G",123,204,196]
[null,null,null,null,6,"H",78,179,211]
[null,null,null,null,7,"J",43,140,190]
[null,null,null,null,8,"K",8,104,172]
[null,null,null,null,9,"M",8,64,129]
["BuGn",3,"seq",null,1,"C",229,245,249]
[null,null,null,null,2,"F",153,216,201]
[null,null,null,null,3,"I",44,162,95]
["BuGn",4,"seq",null,1,"B",237,248,251]
[null,null,null,null,2,"E",178,226,226]
[null,null,null,null,3,"G",102,194,164]
[null,null,null,null,4,"J",35,139,69]
["BuGn",5,"seq",null,1,"B",237,248,251]
[null,null,null,null,2,"E",178,226,226]
[null,null,null,null,3,"G",102,194,164]
[null,null,null,null,4,"I",44,162,95]
[null,null,null,null,5,"K",0,109,44]
["BuGn",6,"seq",null,1,"B",237,248,251]
[null,null,null,null,2,"D",204,236,230]
[null,null,null,null,3,"F",153,216,201]
[null,null,null,null,4,"G",102,194,164]
[null,null,null,null,5,"I",44,162,95]
[null,null,null,null,6,"K",0,109,44]
["BuGn",7,"seq",null,1,"B",237,248,251]
[null,null,null,null,2,"D",204,236,230]
[null,null,null,null,3,"F",153,216,201]
[null,null,null,null,4,"G",102,194,164]
[null,null,null,null,5,"H",65,174,118]
[null,null,null,null,6,"J",35,139,69]
[null,null,null,null,7,"L",0,88,36]
["BuGn",8,"seq",null,1,"A",247,252,253]
[null,null,null,null,2,"C",229,245,249]
[null,null,null,null,3,"D",204,236,230]
[null,null,null,null,4,"F",153,216,201]
[null,null,null,null,5,"G",102,194,164]
[null,null,null,null,6,"H",65,174,118]
[null,null,null,null,7,"J",35,139,69]
[null,null,null,null,8,"L",0,88,36]
["BuGn",9,"seq",null,1,"A",247,252,253]
[null,null,null,null,2,"C",229,245,249]
[null,null,null,null,3,"D",204,236,230]
[null,null,null,null,4,"F",153,216,201]
[null,null,null,null,5,"G",102,194,164]
[null,null,null,null,6,"H",65,174,118]
[null,null,null,null,7,"J",35,139,69]
[null,null,null,null,8,"K",0,109,44]
[null,null,null,null,9,"M",0,68,27]
["PuBuGn",3,"seq",null,1,"C",236,226,240]
[null,null,null,null,2,"F",166,189,219]
[null,null,null,null,3,"I",28,144,153]
["PuBuGn",4,"seq",null,1,"B",246,239,247]
[null,null,null,null,2,"E",189,201,225]
[null,null,null,null,3,"G",103,169,207]
[null,null,null,null,4,"J",2,129,138]
["PuBuGn",5,"seq",null,1,"B",246,239,247]
[null,null,null,null,2,"E",189,201,225]
[null,null,null,null,3,"G",103,169,207]
[null,null,null,null,4,"I",28,144,153]
[null,null,null,null,5,"K",1,108,89]
["PuBuGn",6,"seq",null,1,"B",246,239,247]
[null,null,null,null,2,"D",208,209,230]
[null,null,null,null,3,"F",166,189,219]
[null,null,null,null,4,"G",103,169,207]
[null,null,null,null,5,"I",28,144,153]
[null,null,null,null,6,"K",1,108,89]
["PuBuGn",7,"seq",null,1,"B",246,239,247]
[null,null,null,null,2,"D",208,209,230]
[null,null,null,null,3,"F",166,189,219]
[null,null,null,null,4,"G",103,169,207]
[null,null,null,null,5,"H",54,144,192]
[null,null,null,null,6,"J",2,129,138]
[null,null,null,null,7,"L",1,100,80]
["PuBuGn",8,"seq",null,1,"A",255,247,251]
[null,null,null,null,2,"C",236,226,240]
[null,null,null,null,3,"D",208,209,230]
[null,null,null,null,4,"F",166,189,219]
[null,null,null,null,5,"G",103,169,207]
[null,null,null,null,6,"H",54,144,192]
[null,null,null,null,7,"J",2,129,138]
[null,null,null,null,8,"L",1,100,80]
["PuBuGn",9,"seq",null,1,"A",255,247,251]
[null,null,null,null,2,"C",236,226,240]
[null,null,null,null,3,"D",208,209,230]
[null,null,null,null,4,"F",166,189,219]
[null,null,null,null,5,"G",103,169,207]
[null,null,null,null,6,"H",54,144,192]
[null,null,null,null,7,"J",2,129,138]
[null,null,null,null,8,"K",1,108,89]
[null,null,null,null,9,"M",1,70,54]
["PuBu",3,"seq",null,1,"C",236,231,242]
[null,null,null,null,2,"F",166,189,219]
[null,null,null,null,3,"I",43,140,190]
["PuBu",4,"seq",null,1,"B",241,238,246]
[null,null,null,null,2,"E",189,201,225]
[null,null,null,null,3,"G",116,169,207]
[null,null,null,null,4,"J",5,112,176]
["PuBu",5,"seq",null,1,"B",241,238,246]
[null,null,null,null,2,"E",189,201,225]
[null,null,null,null,3,"G",116,169,207]
[null,null,null,null,4,"I",43,140,190]
[null,null,null,null,5,"K",4,90,141]
["PuBu",6,"seq",null,1,"B",241,238,246]
[null,null,null,null,2,"D",208,209,230]
[null,null,null,null,3,"F",166,189,219]
[null,null,null,null,4,"G",116,169,207]
[null,null,null,null,5,"I",43,140,190]
[null,null,null,null,6,"K",4,90,141]
["PuBu",7,"seq",null,1,"B",241,238,246]
[null,null,null,null,2,"D",208,209,230]
[null,null,null,null,3,"F",166,189,219]
[null,null,null,null,4,"G",116,169,207]
[null,null,null,null,5,"H",54,144,192]
[null,null,null,null,6,"J",5,112,176]
[null,null,null,null,7,"L",3,78,123]
["PuBu",8,"seq",null,1,"A",255,247,251]
[null,null,null,null,2,"C",236,231,242]
[null,null,null,null,3,"D",208,209,230]
[null,null,null,null,4,"F",166,189,219]
[null,null,null,null,5,"G",116,169,207]
[null,null,null,null,6,"H",54,144,192]
[null,null,null,null,7,"J",5,112,176]
[null,null,null,null,8,"L",3,78,123]
["PuBu",9,"seq",null,1,"A",255,247,251]
[null,null,null,null,2,"C",236,231,242]
[null,null,null,null,3,"D",208,209,230]
[null,null,null,null,4,"F",166,189,219]
[null,null,null,null,5,"G",116,169,207]
[null,null,null,null,6,"H",54,144,192]
[null,null,null,null,7,"J",5,112,176]
[null,null,null,null,8,"K",4,90,141]
[null,null,null,null,9,"M",2,56,88]
["BuPu",3,"seq",null,1,"C",224,236,244]
[null,null,null,null,2,"F",158,188,218]
[null,null,null,null,3,"I",136,86,167]
["BuPu",4,"seq",null,1,"B",237,248,251]
[null,null,null,null,2,"E",179,205,227]
[null,null,null,null,3,"G",140,150,198]
[null,null,null,null,4,"J",136,65,157]
["BuPu",5,"seq",null,1,"B",237,248,251]
[null,null,null,null,2,"E",179,205,227]
[null,null,null,null,3,"G",140,150,198]
[null,null,null,null,4,"I",136,86,167]
[null,null,null,null,5,"K",129,15,124]
["BuPu",6,"seq",null,1,"B",237,248,251]
[null,null,null,null,2,"D",191,211,230]
[null,null,null,null,3,"F",158,188,218]
[null,null,null,null,4,"G",140,150,198]
[null,null,null,null,5,"I",136,86,167]
[null,null,null,null,6,"K",129,15,124]
["BuPu",7,"seq",null,1,"B",237,248,251]
[null,null,null,null,2,"D",191,211,230]
[null,null,null,null,3,"F",158,188,218]
[null,null,null,null,4,"G",140,150,198]
[null,null,null,null,5,"H",140,107,177]
[null,null,null,null,6,"J",136,65,157]
[null,null,null,null,7,"L",110,1,107]
["BuPu",8,"seq",null,1,"A",247,252,253]
[null,null,null,null,2,"C",224,236,244]
[null,null,null,null,3,"D",191,211,230]
[null,null,null,null,4,"F",158,188,218]
[null,null,null,null,5,"G",140,150,198]
[null,null,null,null,6,"H",140,107,177]
[null,null,null,null,7,"J",136,65,157]
[null,null,null,null,8,"L",110,1,107]
["BuPu",9,"seq",null,1,"A",247,252,253]
[null,null,null,null,2,"C",224,236,244]
[null,null,null,null,3,"D",191,211,230]
[null,null,null,null,4,"F",158,188,218]
[null,null,null,null,5,"G",140,150,198]
[null,null,null,null,6,"H",140,107,177]
[null,null,null,null,7,"J",136,65,157]
[null,null,null,null,8,"K",129,15,124]
[null,null,null,null,9,"M",77,0,75]
["RdPu",3,"seq",null,1,"C",253,224,221]
[null,null,null,null,2,"F",250,159,181]
[null,null,null,null,3,"I",197,27,138]
["RdPu",4,"seq",null,1,"B",254,235,226]
[null,null,null,null,2,"E",251,180,185]
[null,null,null,null,3,"G",247,104,161]
[null,null,null,null,4,"J",174,1,126]
["RdPu",5,"seq",null,1,"B",254,235,226]
[null,null,null,null,2,"E",251,180,185]
[null,null,null,null,3,"G",247,104,161]
[null,null,null,null,4,"I",197,27,138]
[null,null,null,null,5,"K",122,1,119]
["RdPu",6,"seq",null,1,"B",254,235,226]
[null,null,null,null,2,"D",252,197,192]
[null,null,null,null,3,"F",250,159,181]
[null,null,null,null,4,"G",247,104,161]
[null,null,null,null,5,"I",197,27,138]
[null,null,null,null,6,"K",122,1,119]
["RdPu",7,"seq",null,1,"B",254,235,226]
[null,null,null,null,2,"D",252,197,192]
[null,null,null,null,3,"F",250,159,181]
[null,null,null,null,4,"G",247,104,161]
[null,null,null,null,5,"H",221,52,151]
[null,null,null,null,6,"J",174,1,126]
[null,null,null,null,7,"L",122,1,119]
["RdPu",8,"seq",null,1,"A",255,247,243]
[null,null,null,null,2,"C",253,224,221]
[null,null,null,null,3,"D",252,197,192]
[null,null,null,null,4,"F",250,159,181]
[null,null,null,null,5,"G",247,104,161]
[null,null,null,null,6,"H",221,52,151]
[null,null,null,null,7,"J",174,1,126]
[null,null,null,null,8,"L",122,1,119]
["RdPu",9,"seq",null,1,"A",255,247,243]
[null,null,null,null,2,"C",253,224,221]
[null,null,null,null,3,"D",252,197,192]
[null,null,null,null,4,"F",250,159,181]
[null,null,null,null,5,"G",247,104,161]
[null,null,null,null,6,"H",221,52,151]
[null,null,null,null,7,"J",174,1,126]
[null,null,null,null,8,"K",122,1,119]
[null,null,null,null,9,"M",73,0,106]
["PuRd",3,"seq",null,1,"C",231,225,239]
[null,null,null,null,2,"F",201,148,199]
[null,null,null,null,3,"I",221,28,119]
["PuRd",4,"seq",null,1,"B",241,238,246]
[null,null,null,null,2,"E",215,181,216]
[null,null,null,null,3,"G",223,101,176]
[null,null,null,null,4,"J",206,18,86]
["PuRd",5,"seq",null,1,"B",241,238,246]
[null,null,null,null,2,"E",215,181,216]
[null,null,null,null,3,"G",223,101,176]
[null,null,null,null,4,"I",221,28,119]
[null,null,null,null,5,"K",152,0,67]
["PuRd",6,"seq",null,1,"B",241,238,246]
[null,null,null,null,2,"D",212,185,218]
[null,null,null,null,3,"F",201,148,199]
[null,null,null,null,4,"G",223,101,176]
[null,null,null,null,5,"I",221,28,119]
[null,null,null,null,6,"K",152,0,67]
["PuRd",7,"seq",null,1,"B",241,238,246]
[null,null,null,null,2,"D",212,185,218]
[null,null,null,null,3,"F",201,148,199]
[null,null,null,null,4,"G",223,101,176]
[null,null,null,null,5,"H",231,41,138]
[null,null,null,null,6,"J",206,18,86]
[null,null,null,null,7,"L",145,0,63]
["PuRd",8,"seq",null,1,"A",247,244,249]
[null,null,null,null,2,"C",231,225,239]
[null,null,null,null,3,"D",212,185,218]
[null,null,null,null,4,"F",201,148,199]
[null,null,null,null,5,"G",223,101,176]
[null,null,null,null,6,"H",231,41,138]
[null,null,null,null,7,"J",206,18,86]
[null,null,null,null,8,"L",145,0,63]
["PuRd",9,"seq",null,1,"A",247,244,249]
[null,null,null,null,2,"C",231,225,239]
[null,null,null,null,3,"D",212,185,218]
[null,null,null,null,4,"F",201,148,199]
[null,null,null,null,5,"G",223,101,176]
[null,null,null,null,6,"H",231,41,138]
[null,null,null,null,7,"J",206,18,86]
[null,null,null,null,8,"K",152,0,67]
[null,null,null,null,9,"M",103,0,31]
["OrRd",3,"seq",null,1,"C",254,232,200]
[null,null,null,null,2,"F",253,187,132]
[null,null,null,null,3,"I",227,74,51]
["OrRd",4,"seq",null,1,"B",254,240,217]
[null,null,null,null,2,"E",253,204,138]
[null,null,null,null,3,"G",252,141,89]
[null,null,null,null,4,"J",215,48,31]
["OrRd",5,"seq",null,1,"B",254,240,217]
[null,null,null,null,2,"E",253,204,138]
[null,null,null,null,3,"G",252,141,89]
[null,null,null,null,4,"I",227,74,51]
[null,null,null,null,5,"K",179,0,0]
["OrRd",6,"seq",null,1,"B",254,240,217]
[null,null,null,null,2,"D",253,212,158]
[null,null,null,null,3,"F",253,187,132]
[null,null,null,null,4,"G",252,141,89]
[null,null,null,null,5,"I",227,74,51]
[null,null,null,null,6,"K",179,0,0]
["OrRd",7,"seq",null,1,"B",254,240,217]
[null,null,null,null,2,"D",253,212,158]
[null,null,null,null,3,"F",253,187,132]
[null,null,null,null,4,"G",252,141,89]
[null,null,null,null,5,"H",239,101,72]
[null,null,null,null,6,"J",215,48,31]
[null,null,null,null,7,"L",153,0,0]
["OrRd",8,"seq",null,1,"A",255,247,236]
[null,null,null,null,2,"C",254,232,200]
[null,null,null,null,3,"D",253,212,158]
[null,null,null,null,4,"F",253,187,132]
[null,null,null,null,5,"G",252,141,89]
[null,null,null,null,6,"H",239,101,72]
[null,null,null,null,7,"J",215,48,31]
[null,null,null,null,8,"L",153,0,0]
["OrRd",9,"seq",null,1,"A",255,247,236]
[null,null,null,null,2,"C",254,232,200]
[null,null,null,null,3,"D",253,212,158]
[null,null,null,null,4,"F",253,187,132]
[null,null,null,null,5,"G",252,141,89]
[null,null,null,null,6,"H",239,101,72]
[null,null,null,null,7,"J",215,48,31]
[null,null,null,null,8,"K",179,0,0]
[null,null,null,null,9,"M",127,0,0]
["YlOrRd",3,"seq",null,1,"C",255,237,160]
[null,null,null,null,2,"F",254,178,76]
[null,null,null,null,3,"I",240,59,32]
["YlOrRd",4,"seq",null,1,"B",255,255,178]
[null,null,null,null,2,"E",254,204,92]
[null,null,null,null,3,"G",253,141,60]
[null,null,null,null,4,"J",227,26,28]
["YlOrRd",5,"seq",null,1,"B",255,255,178]
[null,null,null,null,2,"E",254,204,92]
[null,null,null,null,3,"G",253,141,60]
[null,null,null,null,4,"I",240,59,32]
[null,null,null,null,5,"K",189,0,38]
["YlOrRd",6,"seq",null,1,"B",255,255,178]
[null,null,null,null,2,"D",254,217,118]
[null,null,null,null,3,"F",254,178,76]
[null,null,null,null,4,"G",253,141,60]
[null,null,null,null,5,"I",240,59,32]
[null,null,null,null,6,"K",189,0,38]
["YlOrRd",7,"seq",null,1,"B",255,255,178]
[null,null,null,null,2,"D",254,217,118]
[null,null,null,null,3,"F",254,178,76]
[null,null,null,null,4,"G",253,141,60]
[null,null,null,null,5,"H",252,78,42]
[null,null,null,null,6,"J",227,26,28]
[null,null,null,null,7,"L",177,0,38]
["YlOrRd",8,"seq",null,1,"A",255,255,204]
[null,null,null,null,2,"C",255,237,160]
[null,null,null,null,3,"D",254,217,118]
[null,null,null,null,4,"F",254,178,76]
[null,null,null,null,5,"G",253,141,60]
[null,null,null,null,6,"H",252,78,42]
[null,null,null,null,7,"J",227,26,28]
[null,null,null,null,8,"L",177,0,38]
["YlOrRd",9,"seq",null,1,"A",255,255,204]
[null,null,null,null,2,"C",255,237,160]
[null,null,null,null,3,"D",254,217,118]
[null,null,null,null,4,"F",254,178,76]
[null,null,null,null,5,"G",253,141,60]
[null,null,null,null,6,"H",252,78,42]
[null,null,null,null,7,"J",227,26,28]
[null,null,null,null,8,"K",189,0,38]
[null,null,null,null,9,"M",128,0,38]
["YlOrBr",3,"seq",null,1,"C",255,247,188]
[null,null,null,null,2,"F",254,196,79]
[null,null,null,null,3,"I",217,95,14]
["YlOrBr",4,"seq",null,1,"B",255,255,212]
[null,null,null,null,2,"E",254,217,142]
[null,null,null,null,3,"G",254,153,41]
[null,null,null,null,4,"J",204,76,2]
["YlOrBr",5,"seq",null,1,"B",255,255,212]
[null,null,null,null,2,"E",254,217,142]
[null,null,null,null,3,"G",254,153,41]
[null,null,null,null,4,"I",217,95,14]
[null,null,null,null,5,"K",153,52,4]
["YlOrBr",6,"seq",null,1,"B",255,255,212]
[null,null,null,null,2,"D",254,227,145]
[null,null,null,null,3,"F",254,196,79]
[null,null,null,null,4,"G",254,153,41]
[null,null,null,null,5,"I",217,95,14]
[null,null,null,null,6,"K",153,52,4]
["YlOrBr",7,"seq",null,1,"B",255,255,212]
[null,null,null,null,2,"D",254,227,145]
[null,null,null,null,3,"F",254,196,79]
[null,null,null,null,4,"G",254,153,41]
[null,null,null,null,5,"H",236,112,20]
[null,null,null,null,6,"J",204,76,2]
[null,null,null,null,7,"L",140,45,4]
["YlOrBr",8,"seq",null,1,"A",255,255,229]
[null,null,null,null,2,"C",255,247,188]
[null,null,null,null,3,"D",254,227,145]
[null,null,null,null,4,"F",254,196,79]
[null,null,null,null,5,"G",254,153,41]
[null,null,null,null,6,"H",236,112,20]
[null,null,null,null,7,"J",204,76,2]
[null,null,null,null,8,"L",140,45,4]
["YlOrBr",9,"seq",null,1,"A",255,255,229]
[null,null,null,null,2,"C",255,247,188]
[null,null,null,null,3,"D",254,227,145]
[null,null,null,null,4,"F",254,196,79]
[null,null,null,null,5,"G",254,153,41]
[null,null,null,null,6,"H",236,112,20]
[null,null,null,null,7,"J",204,76,2]
[null,null,null,null,8,"K",153,52,4]
[null,null,null,null,9,"M",102,37,6]
["Purples",3,"seq",null,1,"C",239,237,245]
[null,null,null,null,2,"F",188,189,220]
[null,null,null,null,3,"I",117,107,177]
["Purples",4,"seq",null,1,"B",242,240,247]
[null,null,null,null,2,"E",203,201,226]
[null,null,null,null,3,"G",158,154,200]
[null,null,null,null,4,"J",106,81,163]
["Purples",5,"seq",null,1,"B",242,240,247]
[null,null,null,null,2,"E",203,201,226]
[null,null,null,null,3,"G",158,154,200]
[null,null,null,null,4,"I",117,107,177]
[null,null,null,null,5,"K",84,39,143]
["Purples",6,"seq",null,1,"B",242,240,247]
[null,null,null,null,2,"D",218,218,235]
[null,null,null,null,3,"F",188,189,220]
[null,null,null,null,4,"G",158,154,200]
[null,null,null,null,5,"I",117,107,177]
[null,null,null,null,6,"K",84,39,143]
["Purples",7,"seq",null,1,"B",242,240,247]
[null,null,null,null,2,"D",218,218,235]
[null,null,null,null,3,"F",188,189,220]
[null,null,null,null,4,"G",158,154,200]
[null,null,null,null,5,"H",128,125,186]
[null,null,null,null,6,"J",106,81,163]
[null,null,null,null,7,"L",74,20,134]
["Purples",8,"seq",null,1,"A",252,251,253]
[null,null,null,null,2,"C",239,237,245]
[null,null,null,null,3,"D",218,218,235]
[null,null,null,null,4,"F",188,189,220]
[null,null,null,null,5,"G",158,154,200]
[null,null,null,null,6,"H",128,125,186]
[null,null,null,null,7,"J",106,81,163]
[null,null,null,null,8,"L",74,20,134]
["Purples",9,"seq",null,1,"A",252,251,253]
[null,null,null,null,2,"C",239,237,245]
[null,null,null,null,3,"D",218,218,235]
[null,null,null,null,4,"F",188,189,220]
[null,null,null,null,5,"G",158,154,200]
[null,null,null,null,6,"H",128,125,186]
[null,null,null,null,7,"J",106,81,163]
[null,null,null,null,8,"K",84,39,143]
[null,null,null,null,9,"M",63,0,125]
["Blues",3,"seq",null,1,"C",222,235,247]
[null,null,null,null,2,"F",158,202,225]
[null,null,null,null,3,"I",49,130,189]
["Blues",4,"seq",null,1,"B",239,243,255]
[null,null,null,null,2,"E",189,215,231]
[null,null,null,null,3,"G",107,174,214]
[null,null,null,null,4,"J",33,113,181]
["Blues",5,"seq",null,1,"B",239,243,255]
[null,null,null,null,2,"E",189,215,231]
[null,null,null,null,3,"G",107,174,214]
[null,null,null,null,4,"I",49,130,189]
[null,null,null,null,5,"K",8,81,156]
["Blues",6,"seq",null,1,"B",239,243,255]
[null,null,null,null,2,"D",198,219,239]
[null,null,null,null,3,"F",158,202,225]
[null,null,null,null,4,"G",107,174,214]
[null,null,null,null,5,"I",49,130,189]
[null,null,null,null,6,"K",8,81,156]
["Blues",7,"seq",null,1,"B",239,243,255]
[null,null,null,null,2,"D",198,219,239]
[null,null,null,null,3,"F",158,202,225]
[null,null,null,null,4,"G",107,174,214]
[null,null,null,null,5,"H",66,146,198]
[null,null,null,null,6,"J",33,113,181]
[null,null,null,null,7,"L",8,69,148]
["Blues",8,"seq",null,1,"A",247,251,255]
[null,null,null,null,2,"C",222,235,247]
[null,null,null,null,3,"D",198,219,239]
[null,null,null,null,4,"F",158,202,225]
[null,null,null,null,5,"G",107,174,214]
[null,null,null,null,6,"H",66,146,198]
[null,null,null,null,7,"J",33,113,181]
[null,null,null,null,8,"L",8,69,148]
["Blues",9,"seq",null,1,"A",247,251,255]
[null,null,null,null,2,"C",222,235,247]
[null,null,null,null,3,"D",198,219,239]
[null,null,null,null,4,"F",158,202,225]
[null,null,null,null,5,"G",107,174,214]
[null,null,null,null,6,"H",66,146,198]
[null,null,null,null,7,"J",33,113,181]
[null,null,null,null,8,"K",8,81,156]
[null,null,null,null,9,"M",8,48,107]
["Greens",3,"seq",null,1,"C",229,245,224]
[null,null,null,null,2,"F",161,217,155]
[null,null,null,null,3,"I",49,163,84]
["Greens",4,"seq",null,1,"B",237,248,233]
[null,null,null,null,2,"E",186,228,179]
[null,null,null,null,3,"G",116,196,118]
[null,null,null,null,4,"J",35,139,69]
["Greens",5,"seq",null,1,"B",237,248,233]
[null,null,null,null,2,"E",186,228,179]
[null,null,null,null,3,"G",116,196,118]
[null,null,null,null,4,"I",49,163,84]
[null,null,null,null,5,"K",0,109,44]
["Greens",6,"seq",null,1,"B",237,248,233]
[null,null,null,null,2,"D",199,233,192]
[null,null,null,null,3,"F",161,217,155]
[null,null,null,null,4,"G",116,196,118]
[null,null,null,null,5,"I",49,163,84]
[null,null,null,null,6,"K",0,109,44]
["Greens",7,"seq",null,1,"B",237,248,233]
[null,null,null,null,2,"D",199,233,192]
[null,null,null,null,3,"F",161,217,155]
[null,null,null,null,4,"G",116,196,118]
[null,null,null,null,5,"H",65,171,93]
[null,null,null,null,6,"J",35,139,69]
[null,null,null,null,7,"L",0,90,50]
["Greens",8,"seq",null,1,"A",247,252,245]
[null,null,null,null,2,"C",229,245,224]
[null,null,null,null,3,"D",199,233,192]
[null,null,null,null,4,"F",161,217,155]
[null,null,null,null,5,"G",116,196,118]
[null,null,null,null,6,"H",65,171,93]
[null,null,null,null,7,"J",35,139,69]
[null,null,null,null,8,"L",0,90,50]
["Greens",9,"seq",null,1,"A",247,252,245]
[null,null,null,null,2,"C",229,245,224]
[null,null,null,null,3,"D",199,233,192]
[null,null,null,null,4,"F",161,217,155]
[null,null,null,null,5,"G",116,196,118]
[null,null,null,null,6,"H",65,171,93]
[null,null,null,null,7,"J",35,139,69]
[null,null,null,null,8,"K",0,109,44]
[null,null,null,null,9,"M",0,68,27]
["Oranges",3,"seq",null,1,"C",254,230,206]
[null,null,null,null,2,"F",253,174,107]
[null,null,null,null,3,"I",230,85,13]
["Oranges",4,"seq",null,1,"B",254,237,222]
[null,null,null,null,2,"E",253,190,133]
[null,null,null,null,3,"G",253,141,60]
[null,null,null,null,4,"J",217,71,1]
["Oranges",5,"seq",null,1,"B",254,237,222]
[null,null,null,null,2,"E",253,190,133]
[null,null,null,null,3,"G",253,141,60]
[null,null,null,null,4,"I",230,85,13]
[null,null,null,null,5,"K",166,54,3]
["Oranges",6,"seq",null,1,"B",254,237,222]
[null,null,null,null,2,"D",253,208,162]
[null,null,null,null,3,"F",253,174,107]
[null,null,null,null,4,"G",253,141,60]
[null,null,null,null,5,"I",230,85,13]
[null,null,null,null,6,"K",166,54,3]
["Oranges",7,"seq",null,1,"B",254,237,222]
[null,null,null,null,2,"D",253,208,162]
[null,null,null,null,3,"F",253,174,107]
[null,null,null,null,4,"G",253,141,60]
[null,null,null,null,5,"H",241,105,19]
[null,null,null,null,6,"J",217,72,1]
[null,null,null,null,7,"L",140,45,4]
["Oranges",8,"seq",null,1,"A",255,245,235]
[null,null,null,null,2,"C",254,230,206]
[null,null,null,null,3,"D",253,208,162]
[null,null,null,null,4,"F",253,174,107]
[null,null,null,null,5,"G",253,141,60]
[null,null,null,null,6,"H",241,105,19]
[null,null,null,null,7,"J",217,72,1]
[null,null,null,null,8,"L",140,45,4]
["Oranges",9,"seq",null,1,"A",255,245,235]
[null,null,null,null,2,"C",254,230,206]
[null,null,null,null,3,"D",253,208,162]
[null,null,null,null,4,"F",253,174,107]
[null,null,null,null,5,"G",253,141,60]
[null,null,null,null,6,"H",241,105,19]
[null,null,null,null,7,"J",217,72,1]
[null,null,null,null,8,"K",166,54,3]
[null,null,null,null,9,"M",127,39,4]
["Reds",3,"seq",null,1,"C",254,224,210]
[null,null,null,null,2,"F",252,146,114]
[null,null,null,null,3,"I",222,45,38]
["Reds",4,"seq",null,1,"B",254,229,217]
[null,null,null,null,2,"E",252,174,145]
[null,null,null,null,3,"G",251,106,74]
[null,null,null,null,4,"J",203,24,29]
["Reds",5,"seq",null,1,"B",254,229,217]
[null,null,null,null,2,"E",252,174,145]
[null,null,null,null,3,"G",251,106,74]
[null,null,null,null,4,"I",222,45,38]
[null,null,null,null,5,"K",165,15,21]
["Reds",6,"seq",null,1,"B",254,229,217]
[null,null,null,null,2,"D",252,187,161]
[null,null,null,null,3,"F",252,146,114]
[null,null,null,null,4,"G",251,106,74]
[null,null,null,null,5,"I",222,45,38]
[null,null,null,null,6,"K",165,15,21]
["Reds",7,"seq",null,1,"B",254,229,217]
[null,null,null,null,2,"D",252,187,161]
[null,null,null,null,3,"F",252,146,114]
[null,null,null,null,4,"G",251,106,74]
[null,null,null,null,5,"H",239,59,44]
[null,null,null,null,6,"J",203,24,29]
[null,null,null,null,7,"L",153,0,13]
["Reds",8,"seq",null,1,"A",255,245,240]
[null,null,null,null,2,"C",254,224,210]
[null,null,null,null,3,"D",252,187,161]
[null,null,null,null,4,"F",252,146,114]
[null,null,null,null,5,"G",251,106,74]
[null,null,null,null,6,"H",239,59,44]
[null,null,null,null,7,"J",203,24,29]
[null,null,null,null,8,"L",153,0,13]
["Reds",9,"seq",null,1,"A",255,245,240]
[null,null,null,null,2,"C",254,224,210]
[null,null,null,null,3,"D",252,187,161]
[null,null,null,null,4,"F",252,146,114]
[null,null,null,null,5,"G",251,106,74]
[null,null,null,null,6,"H",239,59,44]
[null,null,null,null,7,"J",203,24,29]
[null,null,null,null,8,"K",165,15,21]
[null,null,null,null,9,"M",103,0,13]
["Greys",3,"seq",null,1,"C",240,240,240]
[null,null,null,null,2,"F",189,189,189]
[null,null,null,null,3,"I",99,99,99]
["Greys",4,"seq",null,1,"B",247,247,247]
[null,null,null,null,2,"E",204,204,204]
[null,null,null,null,3,"G",150,150,150]
[null,null,null,null,4,"J",82,82,82]
["Greys",5,"seq",null,1,"B",247,247,247]
[null,null,null,null,2,"E",204,204,204]
[null,null,null,null,3,"G",150,150,150]
[null,null,null,null,4,"I",99,99,99]
[null,null,null,null,5,"K",37,37,37]
["Greys",6,"seq",null,1,"B",247,247,247]
[null,null,null,null,2,"D",217,217,217]
[null,null,null,null,3,"F",189,189,189]
[null,null,null,null,4,"G",150,150,150]
[null,null,null,null,5,"I",99,99,99]
[null,null,null,null,6,"K",37,37,37]
["Greys",7,"seq",null,1,"B",247,247,247]
[null,null,null,null,2,"D",217,217,217]
[null,null,null,null,3,"F",189,189,189]
[null,null,null,null,4,"G",150,150,150]
[null,null,null,null,5,"H",115,115,115]
[null,null,null,null,6,"J",82,82,82]
[null,null,null,null,7,"L",37,37,37]
["Greys",8,"seq",null,1,"A",255,255,255]
[null,null,null,null,2,"C",240,240,240]
[null,null,null,null,3,"D",217,217,217]
[null,null,null,null,4,"F",189,189,189]
[null,null,null,null,5,"G",150,150,150]
[null,null,null,null,6,"H",115,115,115]
[null,null,null,null,7,"J",82,82,82]
[null,null,null,null,8,"L",37,37,37]
["Greys",9,"seq",null,1,"A",255,255,255]
[null,null,null,null,2,"C",240,240,240]
[null,null,null,null,3,"D",217,217,217]
[null,null,null,null,4,"F",189,189,189]
[null,null,null,null,5,"G",150,150,150]
[null,null,null,null,6,"H",115,115,115]
[null,null,null,null,7,"J",82,82,82]
[null,null,null,null,8,"K",37,37,37]
[null,null,null,null,9,"M",0,0,0]
["PuOr",3,"div",2,1,"E",241,163,64]
[null,null,null,null,2,"H",247,247,247,null,null,"<","9 Diverging Schemes"]
[null,null,null,null,3,"K",153,142,195]
["PuOr",4,"div",2.5,1,"C",230,97,1,null,null,null,"Note:"]
[null,null,null,null,2,"F",253,184,99,null,null,"_","< marks critical class in diverging sheme"]
[null,null,null,null,3,"J",178,171,210,null,null,null,"_ marks critical break"]
[null,null,null,null,4,"M",94,60,153]
["PuOr",5,"div",3,1,"C",230,97,1]
[null,null,null,null,2,"F",253,184,99]
[null,null,null,null,3,"H",247,247,247,null,null,"<"]
[null,null,null,null,4,"J",178,171,210]
[null,null,null,null,5,"M",94,60,153]
["PuOr",6,"div",3.5,1,"B",179,88,6]
[null,null,null,null,2,"E",241,163,64]
[null,null,null,null,3,"G",254,224,182,null,null,"_"]
[null,null,null,null,4,"I",216,218,235]
[null,null,null,null,5,"K",153,142,195]
[null,null,null,null,6,"N",84,39,136]
["PuOr",7,"div",4,1,"B",179,88,6]
[null,null,null,null,2,"E",241,163,64]
[null,null,null,null,3,"G",254,224,182]
[null,null,null,null,4,"H",247,247,247,null,null,"<"]
[null,null,null,null,5,"I",216,218,235]
[null,null,null,null,6,"K",153,142,195]
[null,null,null,null,7,"N",84,39,136]
["PuOr",8,"div",4.5,1,"B",179,88,6]
[null,null,null,null,2,"D",224,130,20]
[null,null,null,null,3,"F",253,184,99]
[null,null,null,null,4,"G",254,224,182,null,null,"_"]
[null,null,null,null,5,"I",216,218,235]
[null,null,null,null,6,"J",178,171,210]
[null,null,null,null,7,"L",128,115,172]
[null,null,null,null,8,"N",84,39,136]
["PuOr",9,"div",5,1,"B",179,88,6]
[null,null,null,null,2,"D",224,130,20]
[null,null,null,null,3,"F",253,184,99]
[null,null,null,null,4,"G",254,224,182]
[null,null,null,null,5,"H",247,247,247,null,null,"<"]
[null,null,null,null,6,"I",216,218,235]
[null,null,null,null,7,"J",178,171,210]
[null,null,null,null,8,"L",128,115,172]
[null,null,null,null,9,"N",84,39,136]
["PuOr",10,"div",5.5,1,"A",127,59,8]
[null,null,null,null,2,"B",179,88,6]
[null,null,null,null,3,"D",224,130,20]
[null,null,null,null,4,"F",253,184,99]
[null,null,null,null,5,"G",254,224,182,null,null,"_"]
[null,null,null,null,6,"I",216,218,235]
[null,null,null,null,7,"J",178,171,210]
[null,null,null,null,8,"L",128,115,172]
[null,null,null,null,9,"N",84,39,136]
[null,null,null,null,10,"O",45,0,75]
["PuOr",11,"div",6,1,"A",127,59,8]
[null,null,null,null,2,"B",179,88,6]
[null,null,null,null,3,"D",224,130,20]
[null,null,null,null,4,"F",253,184,99]
[null,null,null,null,5,"G",254,224,182]
[null,null,null,null,6,"H",247,247,247,null,null,"<"]
[null,null,null,null,7,"I",216,218,235]
[null,null,null,null,8,"J",178,171,210]
[null,null,null,null,9,"L",128,115,172]
[null,null,null,null,10,"N",84,39,136]
[null,null,null,null,11,"O",45,0,75]
["BrBG",3,"div",2,1,"E",216,179,101]
[null,null,null,null,2,"H",245,245,245,null,null,"<"]
[null,null,null,null,3,"K",90,180,172]
["BrBG",4,"div",2.5,1,"C",166,97,26]
[null,null,null,null,2,"F",223,194,125,null,null,"_"]
[null,null,null,null,3,"J",128,205,193]
[null,null,null,null,4,"M",1,133,113]
["BrBG",5,"div",3,1,"C",166,97,26]
[null,null,null,null,2,"F",223,194,125]
[null,null,null,null,3,"H",245,245,245,null,null,"<"]
[null,null,null,null,4,"J",128,205,193]
[null,null,null,null,5,"M",1,133,113]
["BrBG",6,"div",3.5,1,"B",140,81,10]
[null,null,null,null,2,"E",216,179,101]
[null,null,null,null,3,"G",246,232,195,null,null,"_"]
[null,null,null,null,4,"I",199,234,229]
[null,null,null,null,5,"K",90,180,172]
[null,null,null,null,6,"N",1,102,94]
["BrBG",7,"div",4,1,"B",140,81,10]
[null,null,null,null,2,"E",216,179,101]
[null,null,null,null,3,"G",246,232,195]
[null,null,null,null,4,"H",245,245,245,null,null,"<"]
[null,null,null,null,5,"I",199,234,229]
[null,null,null,null,6,"K",90,180,172]
[null,null,null,null,7,"N",1,102,94]
["BrBG",8,"div",4.5,1,"B",140,81,10]
[null,null,null,null,2,"D",191,129,45]
[null,null,null,null,3,"F",223,194,125]
[null,null,null,null,4,"G",246,232,195,null,null,"_"]
[null,null,null,null,5,"I",199,234,229]
[null,null,null,null,6,"J",128,205,193]
[null,null,null,null,7,"L",53,151,143]
[null,null,null,null,8,"N",1,102,94]
["BrBG",9,"div",5,1,"B",140,81,10]
[null,null,null,null,2,"D",191,129,45]
[null,null,null,null,3,"F",223,194,125]
[null,null,null,null,4,"G",246,232,195]
[null,null,null,null,5,"H",245,245,245,null,null,"<"]
[null,null,null,null,6,"I",199,234,229]
[null,null,null,null,7,"J",128,205,193]
[null,null,null,null,8,"L",53,151,143]
[null,null,null,null,9,"N",1,102,94]
["BrBG",10,"div",5.5,1,"A",84,48,5]
[null,null,null,null,2,"B",140,81,10]
[null,null,null,null,3,"D",191,129,45]
[null,null,null,null,4,"F",223,194,125]
[null,null,null,null,5,"G",246,232,195,null,null,"_"]
[null,null,null,null,6,"I",199,234,229]
[null,null,null,null,7,"J",128,205,193]
[null,null,null,null,8,"L",53,151,143]
[null,null,null,null,9,"N",1,102,94]
[null,null,null,null,10,"O",0,60,48]
["BrBG",11,"div",6,1,"A",84,48,5]
[null,null,null,null,2,"B",140,81,10]
[null,null,null,null,3,"D",191,129,45]
[null,null,null,null,4,"F",223,194,125]
[null,null,null,null,5,"G",246,232,195]
[null,null,null,null,6,"H",245,245,245,null,null,"<"]
[null,null,null,null,7,"I",199,234,229]
[null,null,null,null,8,"J",128,205,193]
[null,null,null,null,9,"L",53,151,143]
[null,null,null,null,10,"N",1,102,94]
[null,null,null,null,11,"O",0,60,48]
["PRGn",3,"div",2,1,"E",175,141,195]
[null,null,null,null,2,"H",247,247,247,null,null,"<"]
[null,null,null,null,3,"K",127,191,123]
["PRGn",4,"div",2.5,1,"C",123,50,148]
[null,null,null,null,2,"F",194,165,207,null,null,"_"]
[null,null,null,null,3,"J",166,219,160]
[null,null,null,null,4,"M",0,136,55]
["PRGn",5,"div",3,1,"C",123,50,148]
[null,null,null,null,2,"F",194,165,207]
[null,null,null,null,3,"H",247,247,247,null,null,"<"]
[null,null,null,null,4,"J",166,219,160]
[null,null,null,null,5,"M",0,136,55]
["PRGn",6,"div",3.5,1,"B",118,42,131]
[null,null,null,null,2,"E",175,141,195]
[null,null,null,null,3,"G",231,212,232,null,null,"_"]
[null,null,null,null,4,"I",217,240,211]
[null,null,null,null,5,"K",127,191,123]
[null,null,null,null,6,"N",27,120,55]
["PRGn",7,"div",4,1,"B",118,42,131]
[null,null,null,null,2,"E",175,141,195]
[null,null,null,null,3,"G",231,212,232]
[null,null,null,null,4,"H",247,247,247,null,null,"<"]
[null,null,null,null,5,"I",217,240,211]
[null,null,null,null,6,"K",127,191,123]
[null,null,null,null,7,"N",27,120,55]
["PRGn",8,"div",4.5,1,"B",118,42,131]
[null,null,null,null,2,"D",153,112,171]
[null,null,null,null,3,"F",194,165,207]
[null,null,null,null,4,"G",231,212,232,null,null,"_"]
[null,null,null,null,5,"I",217,240,211]
[null,null,null,null,6,"J",166,219,160]
[null,null,null,null,7,"L",90,174,97]
[null,null,null,null,8,"N",27,120,55]
["PRGn",9,"div",5,1,"B",118,42,131]
[null,null,null,null,2,"D",153,112,171]
[null,null,null,null,3,"F",194,165,207]
[null,null,null,null,4,"G",231,212,232]
[null,null,null,null,5,"H",247,247,247,null,null,"<"]
[null,null,null,null,6,"I",217,240,211]
[null,null,null,null,7,"J",166,219,160]
[null,null,null,null,8,"L",90,174,97]
[null,null,null,null,9,"N",27,120,55]
["PRGn",10,"div",5.5,1,"A",64,0,75]
[null,null,null,null,2,"B",118,42,131]
[null,null,null,null,3,"D",153,112,171]
[null,null,null,null,4,"F",194,165,207]
[null,null,null,null,5,"G",231,212,232,null,null,"_"]
[null,null,null,null,6,"I",217,240,211]
[null,null,null,null,7,"J",166,219,160]
[null,null,null,null,8,"L",90,174,97]
[null,null,null,null,9,"N",27,120,55]
[null,null,null,null,10,"O",0,68,27]
["PRGn",11,"div",6,1,"A",64,0,75]
[null,null,null,null,2,"B",118,42,131]
[null,null,null,null,3,"D",153,112,171]
[null,null,null,null,4,"F",194,165,207]
[null,null,null,null,5,"G",231,212,232]
[null,null,null,null,6,"H",247,247,247,null,null,"<"]
[null,null,null,null,7,"I",217,240,211]
[null,null,null,null,8,"J",166,219,160]
[null,null,null,null,9,"L",90,174,97]
[null,null,null,null,10,"N",27,120,55]
[null,null,null,null,11,"O",0,68,27]
["PiYG",3,"div",2,1,"E",233,163,201]
[null,null,null,null,2,"H",247,247,247,null,null,"<"]
[null,null,null,null,3,"K",161,215,106]
["PiYG",4,"div",2.5,1,"C",208,28,139]
[null,null,null,null,2,"F",241,182,218,null,null,"_"]
[null,null,null,null,3,"J",184,225,134]
[null,null,null,null,4,"M",77,172,38]
["PiYG",5,"div",3,1,"C",208,28,139]
[null,null,null,null,2,"F",241,182,218]
[null,null,null,null,3,"H",247,247,247,null,null,"<"]
[null,null,null,null,4,"J",184,225,134]
[null,null,null,null,5,"M",77,172,38]
["PiYG",6,"div",3.5,1,"B",197,27,125]
[null,null,null,null,2,"E",233,163,201]
[null,null,null,null,3,"G",253,224,239,null,null,"_"]
[null,null,null,null,4,"I",230,245,208]
[null,null,null,null,5,"K",161,215,106]
[null,null,null,null,6,"N",77,146,33]
["PiYG",7,"div",4,1,"B",197,27,125]
[null,null,null,null,2,"E",233,163,201]
[null,null,null,null,3,"G",253,224,239]
[null,null,null,null,4,"H",247,247,247,null,null,"<"]
[null,null,null,null,5,"I",230,245,208]
[null,null,null,null,6,"K",161,215,106]
[null,null,null,null,7,"N",77,146,33]
["PiYG",8,"div",4.5,1,"B",197,27,125]
[null,null,null,null,2,"D",222,119,174]
[null,null,null,null,3,"F",241,182,218]
[null,null,null,null,4,"G",253,224,239,null,null,"_"]
[null,null,null,null,5,"I",230,245,208]
[null,null,null,null,6,"J",184,225,134]
[null,null,null,null,7,"L",127,188,65]
[null,null,null,null,8,"N",77,146,33]
["PiYG",9,"div",5,1,"B",197,27,125]
[null,null,null,null,2,"D",222,119,174]
[null,null,null,null,3,"F",241,182,218]
[null,null,null,null,4,"G",253,224,239]
[null,null,null,null,5,"H",247,247,247,null,null,"<"]
[null,null,null,null,6,"I",230,245,208]
[null,null,null,null,7,"J",184,225,134]
[null,null,null,null,8,"L",127,188,65]
[null,null,null,null,9,"N",77,146,33]
["PiYG",10,"div",5.5,1,"A",142,1,82]
[null,null,null,null,2,"B",197,27,125]
[null,null,null,null,3,"D",222,119,174]
[null,null,null,null,4,"F",241,182,218]
[null,null,null,null,5,"G",253,224,239,null,null,"_"]
[null,null,null,null,6,"I",230,245,208]
[null,null,null,null,7,"J",184,225,134]
[null,null,null,null,8,"L",127,188,65]
[null,null,null,null,9,"N",77,146,33]
[null,null,null,null,10,"O",39,100,25]
["PiYG",11,"div",6,1,"A",142,1,82]
[null,null,null,null,2,"B",197,27,125]
[null,null,null,null,3,"D",222,119,174]
[null,null,null,null,4,"F",241,182,218]
[null,null,null,null,5,"G",253,224,239]
[null,null,null,null,6,"H",247,247,247,null,null,"<"]
[null,null,null,null,7,"I",230,245,208]
[null,null,null,null,8,"J",184,225,134]
[null,null,null,null,9,"L",127,188,65]
[null,null,null,null,10,"N",77,146,33]
[null,null,null,null,11,"O",39,100,25]
["RdBu",3,"div",2,1,"E",239,138,98]
[null,null,null,null,2,"H",247,247,247,null,null,"<"]
[null,null,null,null,3,"K",103,169,207]
["RdBu",4,"div",2.5,1,"C",202,0,32]
[null,null,null,null,2,"F",244,165,130,null,null,"_"]
[null,null,null,null,3,"J",146,197,222]
[null,null,null,null,4,"M",5,113,176]
["RdBu",5,"div",3,1,"C",202,0,32]
[null,null,null,null,2,"F",244,165,130]
[null,null,null,null,3,"H",247,247,247,null,null,"<"]
[null,null,null,null,4,"J",146,197,222]
[null,null,null,null,5,"M",5,113,176]
["RdBu",6,"div",3.5,1,"B",178,24,43]
[null,null,null,null,2,"E",239,138,98]
[null,null,null,null,3,"G",253,219,199,null,null,"_"]
[null,null,null,null,4,"I",209,229,240]
[null,null,null,null,5,"K",103,169,207]
[null,null,null,null,6,"N",33,102,172]
["RdBu",7,"div",4,1,"B",178,24,43]
[null,null,null,null,2,"E",239,138,98]
[null,null,null,null,3,"G",253,219,199]
[null,null,null,null,4,"H",247,247,247,null,null,"<"]
[null,null,null,null,5,"I",209,229,240]
[null,null,null,null,6,"K",103,169,207]
[null,null,null,null,7,"N",33,102,172]
["RdBu",8,"div",4.5,1,"B",178,24,43]
[null,null,null,null,2,"D",214,96,77]
[null,null,null,null,3,"F",244,165,130]
[null,null,null,null,4,"G",253,219,199,null,null,"_"]
[null,null,null,null,5,"I",209,229,240]
[null,null,null,null,6,"J",146,197,222]
[null,null,null,null,7,"L",67,147,195]
[null,null,null,null,8,"N",33,102,172]
["RdBu",9,"div",5,1,"B",178,24,43]
[null,null,null,null,2,"D",214,96,77]
[null,null,null,null,3,"F",244,165,130]
[null,null,null,null,4,"G",253,219,199]
[null,null,null,null,5,"H",247,247,247,null,null,"<"]
[null,null,null,null,6,"I",209,229,240]
[null,null,null,null,7,"J",146,197,222]
[null,null,null,null,8,"L",67,147,195]
[null,null,null,null,9,"N",33,102,172]
["RdBu",10,"div",5.5,1,"A",103,0,31]
[null,null,null,null,2,"B",178,24,43]
[null,null,null,null,3,"D",214,96,77]
[null,null,null,null,4,"F",244,165,130]
[null,null,null,null,5,"G",253,219,199,null,null,"_"]
[null,null,null,null,6,"I",209,229,240]
[null,null,null,null,7,"J",146,197,222]
[null,null,null,null,8,"L",67,147,195]
[null,null,null,null,9,"N",33,102,172]
[null,null,null,null,10,"O",5,48,97]
["RdBu",11,"div",6,1,"A",103,0,31]
[null,null,null,null,2,"B",178,24,43]
[null,null,null,null,3,"D",214,96,77]
[null,null,null,null,4,"F",244,165,130]
[null,null,null,null,5,"G",253,219,199]
[null,null,null,null,6,"H",247,247,247,null,null,"<"]
[null,null,null,null,7,"I",209,229,240]
[null,null,null,null,8,"J",146,197,222]
[null,null,null,null,9,"L",67,147,195]
[null,null,null,null,10,"N",33,102,172]
[null,null,null,null,11,"O",5,48,97]
["RdGy",3,"div",2,1,"E",239,138,98]
[null,null,null,null,2,"H",255,255,255,null,null,"<"]
[null,null,null,null,3,"K",153,153,153]
["RdGy",4,"div",2.5,1,"C",202,0,32]
[null,null,null,null,2,"F",244,165,130,null,null,"_"]
[null,null,null,null,3,"J",186,186,186]
[null,null,null,null,4,"M",64,64,64]
["RdGy",5,"div",3,1,"C",202,0,32]
[null,null,null,null,2,"F",244,165,130]
[null,null,null,null,3,"H",255,255,255,null,null,"<"]
[null,null,null,null,4,"J",186,186,186]
[null,null,null,null,5,"M",64,64,64]
["RdGy",6,"div",3.5,1,"B",178,24,43]
[null,null,null,null,2,"E",239,138,98]
[null,null,null,null,3,"G",253,219,199,null,null,"_"]
[null,null,null,null,4,"I",224,224,224]
[null,null,null,null,5,"K",153,153,153]
[null,null,null,null,6,"N",77,77,77]
["RdGy",7,"div",4,1,"B",178,24,43]
[null,null,null,null,2,"E",239,138,98]
[null,null,null,null,3,"G",253,219,199]
[null,null,null,null,4,"H",255,255,255,null,null,"<"]
[null,null,null,null,5,"I",224,224,224]
[null,null,null,null,6,"K",153,153,153]
[null,null,null,null,7,"N",77,77,77]
["RdGy",8,"div",4.5,1,"B",178,24,43]
[null,null,null,null,2,"D",214,96,77]
[null,null,null,null,3,"F",244,165,130]
[null,null,null,null,4,"G",253,219,199,null,null,"_"]
[null,null,null,null,5,"I",224,224,224]
[null,null,null,null,6,"J",186,186,186]
[null,null,null,null,7,"L",135,135,135]
[null,null,null,null,8,"N",77,77,77]
["RdGy",9,"div",5,1,"B",178,24,43]
[null,null,null,null,2,"D",214,96,77]
[null,null,null,null,3,"F",244,165,130]
[null,null,null,null,4,"G",253,219,199]
[null,null,null,null,5,"H",255,255,255,null,null,"<"]
[null,null,null,null,6,"I",224,224,224]
[null,null,null,null,7,"J",186,186,186]
[null,null,null,null,8,"L",135,135,135]
[null,null,null,null,9,"N",77,77,77]
["RdGy",10,"div",5.5,1,"A",103,0,31]
[null,null,null,null,2,"B",178,24,43]
[null,null,null,null,3,"D",214,96,77]
[null,null,null,null,4,"F",244,165,130]
[null,null,null,null,5,"G",253,219,199,null,null,"_"]
[null,null,null,null,6,"I",224,224,224]
[null,null,null,null,7,"J",186,186,186]
[null,null,null,null,8,"L",135,135,135]
[null,null,null,null,9,"N",77,77,77]
[null,null,null,null,10,"O",26,26,26]
["RdGy",11,"div",6,1,"A",103,0,31]
[null,null,null,null,2,"B",178,24,43]
[null,null,null,null,3,"D",214,96,77]
[null,null,null,null,4,"F",244,165,130]
[null,null,null,null,5,"G",253,219,199]
[null,null,null,null,6,"H",255,255,255,null,null,"<"]
[null,null,null,null,7,"I",224,224,224]
[null,null,null,null,8,"J",186,186,186]
[null,null,null,null,9,"L",135,135,135]
[null,null,null,null,10,"N",77,77,77]
[null,null,null,null,11,"O",26,26,26]
["RdYlBu",3,"div",2,1,"E",252,141,89]
[null,null,null,null,2,"H",255,255,191,null,null,"<"]
[null,null,null,null,3,"K",145,191,219]
["RdYlBu",4,"div",2.5,1,"C",215,25,28]
[null,null,null,null,2,"F",253,174,97,null,null,"_"]
[null,null,null,null,3,"J",171,217,233]
[null,null,null,null,4,"M",44,123,182]
["RdYlBu",5,"div",3,1,"C",215,25,28]
[null,null,null,null,2,"F",253,174,97]
[null,null,null,null,3,"H",255,255,191,null,null,"<"]
[null,null,null,null,4,"J",171,217,233]
[null,null,null,null,5,"M",44,123,182]
["RdYlBu",6,"div",3.5,1,"B",215,48,39]
[null,null,null,null,2,"E",252,141,89]
[null,null,null,null,3,"G",254,224,144,null,null,"_"]
[null,null,null,null,4,"I",224,243,248]
[null,null,null,null,5,"K",145,191,219]
[null,null,null,null,6,"N",69,117,180]
["RdYlBu",7,"div",4,1,"B",215,48,39]
[null,null,null,null,2,"E",252,141,89]
[null,null,null,null,3,"G",254,224,144]
[null,null,null,null,4,"H",255,255,191,null,null,"<"]
[null,null,null,null,5,"I",224,243,248]
[null,null,null,null,6,"K",145,191,219]
[null,null,null,null,7,"N",69,117,180]
["RdYlBu",8,"div",4.5,1,"B",215,48,39]
[null,null,null,null,2,"D",244,109,67]
[null,null,null,null,3,"F",253,174,97]
[null,null,null,null,4,"G",254,224,144,null,null,"_"]
[null,null,null,null,5,"I",224,243,248]
[null,null,null,null,6,"J",171,217,233]
[null,null,null,null,7,"L",116,173,209]
[null,null,null,null,8,"N",69,117,180]
["RdYlBu",9,"div",5,1,"B",215,48,39]
[null,null,null,null,2,"D",244,109,67]
[null,null,null,null,3,"F",253,174,97]
[null,null,null,null,4,"G",254,224,144]
[null,null,null,null,5,"H",255,255,191,null,null,"<"]
[null,null,null,null,6,"I",224,243,248]
[null,null,null,null,7,"J",171,217,233]
[null,null,null,null,8,"L",116,173,209]
[null,null,null,null,9,"N",69,117,180]
["RdYlBu",10,"div",5.5,1,"A",165,0,38]
[null,null,null,null,2,"B",215,48,39]
[null,null,null,null,3,"D",244,109,67]
[null,null,null,null,4,"F",253,174,97]
[null,null,null,null,5,"G",254,224,144,null,null,"_"]
[null,null,null,null,6,"I",224,243,248]
[null,null,null,null,7,"J",171,217,233]
[null,null,null,null,8,"L",116,173,209]
[null,null,null,null,9,"N",69,117,180]
[null,null,null,null,10,"O",49,54,149,null,null,null,null,"t","t","t","t"]
["RdYlBu",11,"div",6,1,"A",165,0,38,null,null,null,null,"O",49,54,149]
[null,null,null,null,2,"B",215,48,39,null,null,null,null,"N",69,117,180]
[null,null,null,null,3,"D",244,109,67,null,null,null,null,"L",116,173,209]
[null,null,null,null,4,"F",253,174,97,null,null,null,null,"J",171,217,233]
[null,null,null,null,5,"G",254,224,144,null,null,null,null,"I",224,243,248]
[null,null,null,null,6,"H",255,255,191,null,null,"<",null,"H",255,255,191]
[null,null,null,null,7,"I",224,243,248,null,null,null,null,"G",254,224,144]
[null,null,null,null,8,"J",171,217,233,null,null,null,null,"F",253,174,97]
[null,null,null,null,9,"L",116,173,209,null,null,null,null,"D",244,109,67]
[null,null,null,null,10,"N",69,117,180,null,null,null,null,"B",215,48,39]
[null,null,null,null,11,"O",49,54,149,null,null,null,null,"A",165,0,38]
["Spectral",3,"div",2,1,"E",252,141,89]
[null,null,null,null,2,"H",255,255,191,null,null,"<"]
[null,null,null,null,3,"K",153,213,148]
["Spectral",4,"div",2.5,1,"C",215,25,28]
[null,null,null,null,2,"F",253,174,97,null,null,"_"]
[null,null,null,null,3,"J",171,221,164]
[null,null,null,null,4,"M",43,131,186]
["Spectral",5,"div",3,1,"C",215,25,28]
[null,null,null,null,2,"F",253,174,97]
[null,null,null,null,3,"H",255,255,191,null,null,"<"]
[null,null,null,null,4,"J",171,221,164]
[null,null,null,null,5,"M",43,131,186]
["Spectral",6,"div",3.5,1,"B",213,62,79]
[null,null,null,null,2,"E",252,141,89]
[null,null,null,null,3,"G",254,224,139,null,null,"_"]
[null,null,null,null,4,"I",230,245,152]
[null,null,null,null,5,"K",153,213,148]
[null,null,null,null,6,"N",50,136,189]
["Spectral",7,"div",4,1,"B",213,62,79]
[null,null,null,null,2,"E",252,141,89]
[null,null,null,null,3,"G",254,224,139]
[null,null,null,null,4,"H",255,255,191,null,null,"<"]
[null,null,null,null,5,"I",230,245,152]
[null,null,null,null,6,"K",153,213,148]
[null,null,null,null,7,"N",50,136,189]
["Spectral",8,"div",4.5,1,"B",213,62,79]
[null,null,null,null,2,"D",244,109,67]
[null,null,null,null,3,"F",253,174,97]
[null,null,null,null,4,"G",254,224,139,null,null,"_"]
[null,null,null,null,5,"I",230,245,152]
[null,null,null,null,6,"J",171,221,164]
[null,null,null,null,7,"L",102,194,165]
[null,null,null,null,8,"N",50,136,189]
["Spectral",9,"div",5,1,"B",213,62,79]
[null,null,null,null,2,"D",244,109,67]
[null,null,null,null,3,"F",253,174,97]
[null,null,null,null,4,"G",254,224,139]
[null,null,null,null,5,"H",255,255,191,null,null,"<"]
[null,null,null,null,6,"I",230,245,152]
[null,null,null,null,7,"J",171,221,164]
[null,null,null,null,8,"L",102,194,165]
[null,null,null,null,9,"N",50,136,189]
["Spectral",10,"div",5.5,1,"A",158,1,66]
[null,null,null,null,2,"B",213,62,79]
[null,null,null,null,3,"D",244,109,67]
[null,null,null,null,4,"F",253,174,97]
[null,null,null,null,5,"G",254,224,139,null,null,"_"]
[null,null,null,null,6,"I",230,245,152]
[null,null,null,null,7,"J",171,221,164]
[null,null,null,null,8,"L",102,194,165]
[null,null,null,null,9,"N",50,136,189]
[null,null,null,null,10,"O",94,79,162,null,null,null,null,"t","t","t","t"]
["Spectral",11,"div",6,1,"A",158,1,66,null,null,null,null,94,79,162,11]
[null,null,null,null,2,"B",213,62,79,null,null,null,null,50,136,189,10]
[null,null,null,null,3,"D",244,109,67,null,null,null,null,102,194,165,9]
[null,null,null,null,4,"F",253,174,97,null,null,null,null,171,221,164,8]
[null,null,null,null,5,"G",254,224,139,null,null,null,null,230,245,152,7]
[null,null,null,null,6,"H",255,255,191,null,null,"<",null,255,255,191,6]
[null,null,null,null,7,"I",230,245,152,null,null,null,null,254,224,139,5]
[null,null,null,null,8,"J",171,221,164,null,null,null,null,253,174,97,4]
[null,null,null,null,9,"L",102,194,165,null,null,null,null,244,109,67,3]
[null,null,null,null,10,"N",50,136,189,null,null,null,null,213,62,79,2]
[null,null,null,null,11,"O",94,79,162,null,null,null,null,158,1,66,1]
["RdYlGn",3,"div",2,1,"E",252,141,89]
[null,null,null,null,2,"H",255,255,191,null,null,"<"]
[null,null,null,null,3,"K",145,207,96]
["RdYlGn",4,"div",2.5,1,"C",215,25,28]
[null,null,null,null,2,"F",253,174,97,null,null,"_"]
[null,null,null,null,3,"J",166,217,106]
[null,null,null,null,4,"M",26,150,65]
["RdYlGn",5,"div",3,1,"C",215,25,28]
[null,null,null,null,2,"F",253,174,97]
[null,null,null,null,3,"H",255,255,191,null,null,"<"]
[null,null,null,null,4,"J",166,217,106]
[null,null,null,null,5,"M",26,150,65]
["RdYlGn",6,"div",3.5,1,"B",215,48,39]
[null,null,null,null,2,"E",252,141,89]
[null,null,null,null,3,"G",254,224,139,null,null,"_"]
[null,null,null,null,4,"I",217,239,139]
[null,null,null,null,5,"K",145,207,96]
[null,null,null,null,6,"N",26,152,80]
["RdYlGn",7,"div",4,1,"B",215,48,39]
[null,null,null,null,2,"E",252,141,89]
[null,null,null,null,3,"G",254,224,139]
[null,null,null,null,4,"H",255,255,191,null,null,"<"]
[null,null,null,null,5,"I",217,239,139]
[null,null,null,null,6,"K",145,207,96]
[null,null,null,null,7,"N",26,152,80]
["RdYlGn",8,"div",4.5,1,"B",215,48,39]
[null,null,null,null,2,"D",244,109,67]
[null,null,null,null,3,"F",253,174,97]
[null,null,null,null,4,"G",254,224,139,null,null,"_"]
[null,null,null,null,5,"I",217,239,139]
[null,null,null,null,6,"J",166,217,106]
[null,null,null,null,7,"L",102,189,99]
[null,null,null,null,8,"N",26,152,80]
["RdYlGn",9,"div",5,1,"B",215,48,39]
[null,null,null,null,2,"D",244,109,67]
[null,null,null,null,3,"F",253,174,97]
[null,null,null,null,4,"G",254,224,139]
[null,null,null,null,5,"H",255,255,191,null,null,"<"]
[null,null,null,null,6,"I",217,239,139]
[null,null,null,null,7,"J",166,217,106]
[null,null,null,null,8,"L",102,189,99]
[null,null,null,null,9,"N",26,152,80]
["RdYlGn",10,"div",5.5,1,"A",165,0,38]
[null,null,null,null,2,"B",215,48,39]
[null,null,null,null,3,"D",244,109,67]
[null,null,null,null,4,"F",253,174,97]
[null,null,null,null,5,"G",254,224,139,null,null,"_"]
[null,null,null,null,6,"I",217,239,139]
[null,null,null,null,7,"J",166,217,106]
[null,null,null,null,8,"L",102,189,99]
[null,null,null,null,9,"N",26,152,80]
[null,null,null,null,10,"O",0,104,55]
["RdYlGn",11,"div",6,1,"A",165,0,38]
[null,null,null,null,2,"B",215,48,39]
[null,null,null,null,3,"D",244,109,67]
[null,null,null,null,4,"F",253,174,97]
[null,null,null,null,5,"G",254,224,139]
[null,null,null,null,6,"H",255,255,191,null,null,"<"]
[null,null,null,null,7,"I",217,239,139]
[null,null,null,null,8,"J",166,217,106]
[null,null,null,null,9,"L",102,189,99]
[null,null,null,null,10,"N",26,152,80]
[null,null,null,null,11,"O",0,104,55]
["Set3",3,"qual",null,1,"A",141,211,199]
[null,null,null,null,2,"B",255,255,179,null,null,null,"8 Qualitative Schemes"]
[null,null,null,null,3,"C",190,186,218]
["Set3",4,"qual",null,1,"A",141,211,199]
[null,null,null,null,2,"B",255,255,179]
[null,null,null,null,3,"C",190,186,218]
[null,null,null,null,4,"D",251,128,114]
["Set3",5,"qual",null,1,"A",141,211,199]
[null,null,null,null,2,"B",255,255,179]
[null,null,null,null,3,"C",190,186,218]
[null,null,null,null,4,"D",251,128,114]
[null,null,null,null,5,"E",128,177,211]
["Set3",6,"qual",null,1,"A",141,211,199]
[null,null,null,null,2,"B",255,255,179]
[null,null,null,null,3,"C",190,186,218]
[null,null,null,null,4,"D",251,128,114]
[null,null,null,null,5,"E",128,177,211]
[null,null,null,null,6,"F",253,180,98]
["Set3",7,"qual",null,1,"A",141,211,199]
[null,null,null,null,2,"B",255,255,179]
[null,null,null,null,3,"C",190,186,218]
[null,null,null,null,4,"D",251,128,114]
[null,null,null,null,5,"E",128,177,211]
[null,null,null,null,6,"F",253,180,98]
[null,null,null,null,7,"G",179,222,105]
["Set3",8,"qual",null,1,"A",141,211,199]
[null,null,null,null,2,"B",255,255,179]
[null,null,null,null,3,"C",190,186,218]
[null,null,null,null,4,"D",251,128,114]
[null,null,null,null,5,"E",128,177,211]
[null,null,null,null,6,"F",253,180,98]
[null,null,null,null,7,"G",179,222,105]
[null,null,null,null,8,"H",252,205,229]
["Set3",9,"qual",null,1,"A",141,211,199]
[null,null,null,null,2,"B",255,255,179]
[null,null,null,null,3,"C",190,186,218]
[null,null,null,null,4,"D",251,128,114]
[null,null,null,null,5,"E",128,177,211]
[null,null,null,null,6,"F",253,180,98]
[null,null,null,null,7,"G",179,222,105]
[null,null,null,null,8,"H",252,205,229]
[null,null,null,null,9,"I",217,217,217]
["Set3",10,"qual",null,1,"A",141,211,199]
[null,null,null,null,2,"B",255,255,179]
[null,null,null,null,3,"C",190,186,218]
[null,null,null,null,4,"D",251,128,114]
[null,null,null,null,5,"E",128,177,211]
[null,null,null,null,6,"F",253,180,98]
[null,null,null,null,7,"G",179,222,105]
[null,null,null,null,8,"H",252,205,229]
[null,null,null,null,9,"I",217,217,217]
[null,null,null,null,10,"J",188,128,189]
["Set3",11,"qual",null,1,"A",141,211,199]
[null,null,null,null,2,"B",255,255,179]
[null,null,null,null,3,"C",190,186,218]
[null,null,null,null,4,"D",251,128,114]
[null,null,null,null,5,"E",128,177,211]
[null,null,null,null,6,"F",253,180,98]
[null,null,null,null,7,"G",179,222,105]
[null,null,null,null,8,"H",252,205,229]
[null,null,null,null,9,"I",217,217,217]
[null,null,null,null,10,"J",188,128,189]
[null,null,null,null,11,"K",204,235,197]
["Set3",12,"qual",null,1,"A",141,211,199]
[null,null,null,null,2,"B",255,255,179]
[null,null,null,null,3,"C",190,186,218]
[null,null,null,null,4,"D",251,128,114]
[null,null,null,null,5,"E",128,177,211]
[null,null,null,null,6,"F",253,180,98]
[null,null,null,null,7,"G",179,222,105]
[null,null,null,null,8,"H",252,205,229]
[null,null,null,null,9,"I",217,217,217]
[null,null,null,null,10,"J",188,128,189]
[null,null,null,null,11,"K",204,235,197]
[null,null,null,null,12,"L",255,237,111]
["Pastel1",3,"qual",null,1,"A",251,180,174]
[null,null,null,null,2,"B",179,205,227]
[null,null,null,null,3,"C",204,235,197]
["Pastel1",4,"qual",null,1,"A",251,180,174]
[null,null,null,null,2,"B",179,205,227]
[null,null,null,null,3,"C",204,235,197]
[null,null,null,null,4,"D",222,203,228]
["Pastel1",5,"qual",null,1,"A",251,180,174]
[null,null,null,null,2,"B",179,205,227]
[null,null,null,null,3,"C",204,235,197]
[null,null,null,null,4,"D",222,203,228]
[null,null,null,null,5,"E",254,217,166]
["Pastel1",6,"qual",null,1,"A",251,180,174]
[null,null,null,null,2,"B",179,205,227]
[null,null,null,null,3,"C",204,235,197]
[null,null,null,null,4,"D",222,203,228]
[null,null,null,null,5,"E",254,217,166]
[null,null,null,null,6,"F",255,255,204]
["Pastel1",7,"qual",null,1,"A",251,180,174]
[null,null,null,null,2,"B",179,205,227]
[null,null,null,null,3,"C",204,235,197]
[null,null,null,null,4,"D",222,203,228]
[null,null,null,null,5,"E",254,217,166]
[null,null,null,null,6,"F",255,255,204]
[null,null,null,null,7,"G",229,216,189]
["Pastel1",8,"qual",null,1,"A",251,180,174]
[null,null,null,null,2,"B",179,205,227]
[null,null,null,null,3,"C",204,235,197]
[null,null,null,null,4,"D",222,203,228]
[null,null,null,null,5,"E",254,217,166]
[null,null,null,null,6,"F",255,255,204]
[null,null,null,null,7,"G",229,216,189]
[null,null,null,null,8,"H",253,218,236]
["Pastel1",9,"qual",null,1,"A",251,180,174]
[null,null,null,null,2,"B",179,205,227]
[null,null,null,null,3,"C",204,235,197]
[null,null,null,null,4,"D",222,203,228]
[null,null,null,null,5,"E",254,217,166]
[null,null,null,null,6,"F",255,255,204]
[null,null,null,null,7,"G",229,216,189]
[null,null,null,null,8,"H",253,218,236]
[null,null,null,null,9,"I",242,242,242]
["Set1",3,"qual",null,1,"A",228,26,28]
[null,null,null,null,2,"B",55,126,184]
[null,null,null,null,3,"C",77,175,74]
["Set1",4,"qual",null,1,"A",228,26,28]
[null,null,null,null,2,"B",55,126,184]
[null,null,null,null,3,"C",77,175,74]
[null,null,null,null,4,"D",152,78,163]
["Set1",5,"qual",null,1,"A",228,26,28]
[null,null,null,null,2,"B",55,126,184]
[null,null,null,null,3,"C",77,175,74]
[null,null,null,null,4,"D",152,78,163]
[null,null,null,null,5,"E",255,127,0]
["Set1",6,"qual",null,1,"A",228,26,28]
[null,null,null,null,2,"B",55,126,184]
[null,null,null,null,3,"C",77,175,74]
[null,null,null,null,4,"D",152,78,163]
[null,null,null,null,5,"E",255,127,0]
[null,null,null,null,6,"F",255,255,51]
["Set1",7,"qual",null,1,"A",228,26,28]
[null,null,null,null,2,"B",55,126,184]
[null,null,null,null,3,"C",77,175,74]
[null,null,null,null,4,"D",152,78,163]
[null,null,null,null,5,"E",255,127,0]
[null,null,null,null,6,"F",255,255,51]
[null,null,null,null,7,"G",166,86,40]
["Set1",8,"qual",null,1,"A",228,26,28]
[null,null,null,null,2,"B",55,126,184]
[null,null,null,null,3,"C",77,175,74]
[null,null,null,null,4,"D",152,78,163]
[null,null,null,null,5,"E",255,127,0]
[null,null,null,null,6,"F",255,255,51]
[null,null,null,null,7,"G",166,86,40]
[null,null,null,null,8,"H",247,129,191]
["Set1",9,"qual",null,1,"A",228,26,28]
[null,null,null,null,2,"B",55,126,184]
[null,null,null,null,3,"C",77,175,74]
[null,null,null,null,4,"D",152,78,163]
[null,null,null,null,5,"E",255,127,0]
[null,null,null,null,6,"F",255,255,51]
[null,null,null,null,7,"G",166,86,40]
[null,null,null,null,8,"H",247,129,191]
[null,null,null,null,9,"I",153,153,153]
["Pastel2",3,"qual",null,1,"A",179,226,205]
[null,null,null,null,2,"B",253,205,172]
[null,null,null,null,3,"C",203,213,232]
["Pastel2",4,"qual",null,1,"A",179,226,205]
[null,null,null,null,2,"B",253,205,172]
[null,null,null,null,3,"C",203,213,232]
[null,null,null,null,4,"D",244,202,228]
["Pastel2",5,"qual",null,1,"A",179,226,205]
[null,null,null,null,2,"B",253,205,172]
[null,null,null,null,3,"C",203,213,232]
[null,null,null,null,4,"D",244,202,228]
[null,null,null,null,5,"E",230,245,201]
["Pastel2",6,"qual",null,1,"A",179,226,205]
[null,null,null,null,2,"B",253,205,172]
[null,null,null,null,3,"C",203,213,232]
[null,null,null,null,4,"D",244,202,228]
[null,null,null,null,5,"E",230,245,201]
[null,null,null,null,6,"F",255,242,174]
["Pastel2",7,"qual",null,1,"A",179,226,205]
[null,null,null,null,2,"B",253,205,172]
[null,null,null,null,3,"C",203,213,232]
[null,null,null,null,4,"D",244,202,228]
[null,null,null,null,5,"E",230,245,201]
[null,null,null,null,6,"F",255,242,174]
[null,null,null,null,7,"G",241,226,204]
["Pastel2",8,"qual",null,1,"A",179,226,205]
[null,null,null,null,2,"B",253,205,172]
[null,null,null,null,3,"C",203,213,232]
[null,null,null,null,4,"D",244,202,228]
[null,null,null,null,5,"E",230,245,201]
[null,null,null,null,6,"F",255,242,174]
[null,null,null,null,7,"G",241,226,204]
[null,null,null,null,8,"H",204,204,204]
["Set2",3,"qual",null,1,"A",102,194,165]
[null,null,null,null,2,"B",252,141,98]
[null,null,null,null,3,"C",141,160,203]
["Set2",4,"qual",null,1,"A",102,194,165]
[null,null,null,null,2,"B",252,141,98]
[null,null,null,null,3,"C",141,160,203]
[null,null,null,null,4,"D",231,138,195]
["Set2",5,"qual",null,1,"A",102,194,165]
[null,null,null,null,2,"B",252,141,98]
[null,null,null,null,3,"C",141,160,203]
[null,null,null,null,4,"D",231,138,195]
[null,null,null,null,5,"E",166,216,84]
["Set2",6,"qual",null,1,"A",102,194,165]
[null,null,null,null,2,"B",252,141,98]
[null,null,null,null,3,"C",141,160,203]
[null,null,null,null,4,"D",231,138,195]
[null,null,null,null,5,"E",166,216,84]
[null,null,null,null,6,"F",255,217,47]
["Set2",7,"qual",null,1,"A",102,194,165]
[null,null,null,null,2,"B",252,141,98]
[null,null,null,null,3,"C",141,160,203]
[null,null,null,null,4,"D",231,138,195]
[null,null,null,null,5,"E",166,216,84]
[null,null,null,null,6,"F",255,217,47]
[null,null,null,null,7,"G",229,196,148]
["Set2",8,"qual",null,1,"A",102,194,165]
[null,null,null,null,2,"B",252,141,98]
[null,null,null,null,3,"C",141,160,203]
[null,null,null,null,4,"D",231,138,195]
[null,null,null,null,5,"E",166,216,84]
[null,null,null,null,6,"F",255,217,47]
[null,null,null,null,7,"G",229,196,148]
[null,null,null,null,8,"H",179,179,179]
["Dark2",3,"qual",null,1,"A",27,158,119]
[null,null,null,null,2,"B",217,95,2]
[null,null,null,null,3,"C",117,112,179]
["Dark2",4,"qual",null,1,"A",27,158,119]
[null,null,null,null,2,"B",217,95,2]
[null,null,null,null,3,"C",117,112,179]
[null,null,null,null,4,"D",231,41,138]
["Dark2",5,"qual",null,1,"A",27,158,119]
[null,null,null,null,2,"B",217,95,2]
[null,null,null,null,3,"C",117,112,179]
[null,null,null,null,4,"D",231,41,138]
[null,null,null,null,5,"E",102,166,30]
["Dark2",6,"qual",null,1,"A",27,158,119]
[null,null,null,null,2,"B",217,95,2]
[null,null,null,null,3,"C",117,112,179]
[null,null,null,null,4,"D",231,41,138]
[null,null,null,null,5,"E",102,166,30]
[null,null,null,null,6,"F",230,171,2]
["Dark2",7,"qual",null,1,"A",27,158,119]
[null,null,null,null,2,"B",217,95,2]
[null,null,null,null,3,"C",117,112,179]
[null,null,null,null,4,"D",231,41,138]
[null,null,null,null,5,"E",102,166,30]
[null,null,null,null,6,"F",230,171,2]
[null,null,null,null,7,"G",166,118,29]
["Dark2",8,"qual",null,1,"A",27,158,119]
[null,null,null,null,2,"B",217,95,2]
[null,null,null,null,3,"C",117,112,179]
[null,null,null,null,4,"D",231,41,138]
[null,null,null,null,5,"E",102,166,30]
[null,null,null,null,6,"F",230,171,2]
[null,null,null,null,7,"G",166,118,29]
[null,null,null,null,8,"H",102,102,102]
["Paired",3,"qual",null,1,"A",166,206,227]
[null,null,null,null,2,"B",31,120,180]
[null,null,null,null,3,"C",178,223,138]
["Paired",4,"qual",null,1,"A",166,206,227]
[null,null,null,null,2,"B",31,120,180]
[null,null,null,null,3,"C",178,223,138]
[null,null,null,null,4,"D",51,160,44]
["Paired",5,"qual",null,1,"A",166,206,227]
[null,null,null,null,2,"B",31,120,180]
[null,null,null,null,3,"C",178,223,138]
[null,null,null,null,4,"D",51,160,44]
[null,null,null,null,5,"E",251,154,153]
["Paired",6,"qual",null,1,"A",166,206,227]
[null,null,null,null,2,"B",31,120,180]
[null,null,null,null,3,"C",178,223,138]
[null,null,null,null,4,"D",51,160,44]
[null,null,null,null,5,"E",251,154,153]
[null,null,null,null,6,"F",227,26,28]
["Paired",7,"qual",null,1,"A",166,206,227]
[null,null,null,null,2,"B",31,120,180]
[null,null,null,null,3,"C",178,223,138]
[null,null,null,null,4,"D",51,160,44]
[null,null,null,null,5,"E",251,154,153]
[null,null,null,null,6,"F",227,26,28]
[null,null,null,null,7,"G",253,191,111]
["Paired",8,"qual",null,1,"A",166,206,227]
[null,null,null,null,2,"B",31,120,180]
[null,null,null,null,3,"C",178,223,138]
[null,null,null,null,4,"D",51,160,44]
[null,null,null,null,5,"E",251,154,153]
[null,null,null,null,6,"F",227,26,28]
[null,null,null,null,7,"G",253,191,111]
[null,null,null,null,8,"H",255,127,0]
["Paired",9,"qual",null,1,"A",166,206,227]
[null,null,null,null,2,"B",31,120,180]
[null,null,null,null,3,"C",178,223,138]
[null,null,null,null,4,"D",51,160,44]
[null,null,null,null,5,"E",251,154,153]
[null,null,null,null,6,"F",227,26,28]
[null,null,null,null,7,"G",253,191,111]
[null,null,null,null,8,"H",255,127,0]
[null,null,null,null,9,"I",202,178,214]
["Paired",10,"qual",null,1,"A",166,206,227]
[null,null,null,null,2,"B",31,120,180]
[null,null,null,null,3,"C",178,223,138]
[null,null,null,null,4,"D",51,160,44]
[null,null,null,null,5,"E",251,154,153]
[null,null,null,null,6,"F",227,26,28]
[null,null,null,null,7,"G",253,191,111]
[null,null,null,null,8,"H",255,127,0]
[null,null,null,null,9,"I",202,178,214]
[null,null,null,null,10,"J",106,61,154]
["Paired",11,"qual",null,1,"A",166,206,227]
[null,null,null,null,2,"B",31,120,180]
[null,null,null,null,3,"C",178,223,138]
[null,null,null,null,4,"D",51,160,44]
[null,null,null,null,5,"E",251,154,153]
[null,null,null,null,6,"F",227,26,28]
[null,null,null,null,7,"G",253,191,111]
[null,null,null,null,8,"H",255,127,0]
[null,null,null,null,9,"I",202,178,214]
[null,null,null,null,10,"J",106,61,154]
[null,null,null,null,11,"K",255,255,153]
["Paired",12,"qual",null,1,"A",166,206,227]
[null,null,null,null,2,"B",31,120,180]
[null,null,null,null,3,"C",178,223,138]
[null,null,null,null,4,"D",51,160,44]
[null,null,null,null,5,"E",251,154,153]
[null,null,null,null,6,"F",227,26,28]
[null,null,null,null,7,"G",253,191,111]
[null,null,null,null,8,"H",255,127,0]
[null,null,null,null,9,"I",202,178,214]
[null,null,null,null,10,"J",106,61,154]
[null,null,null,null,11,"K",255,255,153]
[null,null,null,null,12,"L",177,89,40]
["Accent",3,"qual",null,1,"A",127,201,127]
[null,null,null,null,2,"B",190,174,212]
[null,null,null,null,3,"C",253,192,134]
["Accent",4,"qual",null,1,"A",127,201,127]
[null,null,null,null,2,"B",190,174,212]
[null,null,null,null,3,"C",253,192,134]
[null,null,null,null,4,"D",255,255,153]
["Accent",5,"qual",null,1,"A",127,201,127]
[null,null,null,null,2,"B",190,174,212]
[null,null,null,null,3,"C",253,192,134]
[null,null,null,null,4,"D",255,255,153]
[null,null,null,null,5,"E",56,108,176]
["Accent",6,"qual",null,1,"A",127,201,127]
[null,null,null,null,2,"B",190,174,212]
[null,null,null,null,3,"C",253,192,134]
[null,null,null,null,4,"D",255,255,153]
[null,null,null,null,5,"E",56,108,176]
[null,null,null,null,6,"F",240,2,127]
["Accent",7,"qual",null,1,"A",127,201,127]
[null,null,null,null,2,"B",190,174,212]
[null,null,null,null,3,"C",253,192,134]
[null,null,null,null,4,"D",255,255,153]
[null,null,null,null,5,"E",56,108,176]
[null,null,null,null,6,"F",240,2,127]
[null,null,null,null,7,"G",191,91,23]
["Accent",8,"qual",null,1,"A",127,201,127]
[null,null,null,null,2,"B",190,174,212]
[null,null,null,null,3,"C",253,192,134]
[null,null,null,null,4,"D",255,255,153]
[null,null,null,null,5,"E",56,108,176]
[null,null,null,null,6,"F",240,2,127]
[null,null,null,null,7,"G",191,91,23]
[null,null,null,null,8,"H",102,102,102]
[]
["Apache-Style Software License for ColorBrewer software and ColorBrewer Color Schemes"]
[]
["Copyright (c) 2002 Cynthia Brewer, Mark Harrower, and The Pennsylvania State University."]
[]
["Licensed under the Apache License, Version 2.0 (the \"License\"); you may not use this file except in compliance with the License."]
["You may obtain a copy of the License at"]
[]
["       http://www.apache.org/licenses/LICENSE-2.0"]
[]
["Unless required by applicable law or agreed to in writing, software distributed under the License is distributed on an \"AS IS\" BASIS,"]
["WITHOUT WARRANTIES OR CONDITIONS OF ANY KIND, either express or implied."]
["See the License for the specific language governing permissions and limitations under the License."]
[]
[]
["Redistribution and use in source and binary forms, with or without modification, are permitted provided that the following conditions are met:"]
["1. Redistributions as source code must retain the above copyright notice, this list of conditions and the following disclaimer."]
["2. The end-user documentation included with the redistribution, if any, must include the following acknowledgment:"]
["This product includes color specifications and designs developed by Cynthia Brewer (http://colorbrewer.org/)."]
["Alternately, this acknowledgment may appear in the software itself, if and wherever such third-party acknowledgments normally appear."]
["4. The name \"ColorBrewer\" must not be used to endorse or promote products derived from this software without prior written permission. "]
["For written permission, please contact Cynthia Brewer at cbrewer@psu.edu."]
["5. Products derived from this software may not be called \"ColorBrewer\", nor may \"ColorBrewer\" appear in their name, without prior written permission of Cynthia Brewer."]
[]
[]
["This version of the file (4) is sorted to have schemes in the same order as on the ColorBrewer site. Color patches are included"]
["in column K. These were programmed by David P. Ryan as rectangles filled with corresponding RGB colors and inserted in the"]
["cells as comments. Thank you to David for the idea and initiative in making the color examples available in the file."]
[]
["The original ColorBrewer web site is at http://ColorBrewer.org"]
[]
["For more information about ColorBrewer, check the updates section of the site at http://www.personal.psu.edu/cab38/ColorBrewer/ColorBrewer_updates.html"]

{"sheet":"Metadata","index":4,"n_rows":26,"n_cols":31,"rows_kept":26,"cut":false,"hidden":false,"merged":[]}
["type","dyn","Pub","Label","Variable","Description","Units","Source","Native","Geoprocessing Code","Extrapolated?","data type","max","min","step","coloring","bins","binlabels","missing value","categories","cite","Public_Note","p_Native","p_Extrapolated","p_NODATA","Native_Min","Native_Max","Native_Median","Native_Mean","GLOBE_Median","GLOBE_Mean"]
[{"$f":"Data_Entry!B17","v":"H"},"S","Y",{"$f":"Data_Entry!B18","v":"esri_wr25"},{"$f":"Data_Entry!B19","v":"World Regions (ESRI 25)"},{"$f":"Data_Entry!B21","v":"Boundaries for 25 commonly recognized regions of the world."},{"$f":"Data_Entry!B20","v":"regions"},{"$f":"Data_Entry!B22","v":"From ArcGIS online: http://www.arcgis.com/home/item.html?id=84dbc97915244e35808e87a881133d09"},{"$f":"Data_Entry!B26","v":"polygons"},{"$f":"Data_Entry!B27","v":5},{"$f":"Data_Entry!B28","v":"y"},{"$f":"Data_Entry!B29","v":"nominal"},{"$f":"Data_Entry!B31","v":25},{"$f":"Data_Entry!B30","v":1},{"$f":"Data_Entry!B32","v":1},{"$f":"LEGEND!W19","v":"0xE1E1E1,0x07DEA4,0x2816F0,0xEDDB34,0x2774D9,0xFFFF73,0x54F224,0xE825D5,0xCD8966,0xA9D1D6,0x280D54,0xDB0B1C,0x8C7238,0xE4AEFC,0xAEDB81,0x8057E6,0x13B5CF,0x38A800,0x664773,0x898C88,0x700604,0xEFE4BE,0xF52265,0xCDCD66,0xE065CA"},{"$f":"LEGEND!W18","v":"1:1,2:2,3:3,4:4,5:5,6:6,7:7,8:8,9:9,10:10,11:11,12:12,13:13,14:14,15:15,16:16,17:17,18:18,19:19,20:20,21:21,22:22,23:23,24:24,25:25"},{"$f":"LEGEND!W17","v":"[\"Antarctica\",\"Asiatic Russia\",\"Australia/New Zealand\",\"Caribbean\",\"Central America\",\"Central Asia\",\"Eastern Africa\",\"Eastern Asia\",\"Eastern Europe\",\"European Russia\",\"Melanesia\",\"Micronesia\",\"Middle Africa\",\"Northern Africa\",\"Northern America\",\"Northern Europe\",\"Polynesia\",\"South America\",\"Southeastern Asia\",\"Southern Africa\",\"Southern Asia\",\"Southern Europe\",\"Western Africa\",\"Western Asia\",\"Western Europe\"]"},{"$f":"Data_Entry!B33","v":0},{"$f":"LEGEND!W20","v":"{ \"No Data\": 0, \"Antarctica\": 1, \"Asiatic Russia\": 2, \"Australia/New Zealand\": 3, \"Caribbean\": 4, \"Central America\": 5, \"Central Asia\": 6, \"Eastern Africa\": 7, \"Eastern Asia\": 8, \"Eastern Europe\": 9, \"European Russia\": 10, \"Melanesia\": 11, \"Micronesia\": 12, \"Middle Africa\": 13, \"Northern Africa\": 14, \"Northern America\": 15, \"Northern Europe\": 16, \"Polynesia\": 17, \"South America\": 18, \"Southeastern Asia\": 19, \"Southern Africa\": 20, \"Southern Asia\": 21, \"Southern Europe\": 22, \"Western Africa\": 23, \"Western Asia\": 24, \"Western Europe\": 25}"},{"$f":"Data_Entry!B24","v":"ESRI. World Regions. http://www.arcgis.com/home/item.html?id=84dbc97915244e35808e87a881133d09 <downloaded April 2, 2014>"},{"$f":"Data_Entry!B39","v":"Use with reference to ESRI"},{"$f":"IF(ISBLANK(Data_Entry!B40),\"\",Data_Entry!B40)","v":""},{"$f":"IF(ISBLANK(Data_Entry!B41),\"\",Data_Entry!B41)","v":""},{"$f":"IF(ISBLANK(Data_Entry!B42),\"\",Data_Entry!B42)","v":""},{"$f":"IF(ISBLANK(Data_Entry!B43),\"\",Data_Entry!B43)","v":1},{"$f":"IF(ISBLANK(Data_Entry!B44),\"\",Data_Entry!B44)","v":25},{"$f":"IF(ISBLANK(Data_Entry!B45),\"\",Data_Entry!B45)","v":""},{"$f":"IF(ISBLANK(Data_Entry!B46),\"\",Data_Entry!B46)","v":""},{"$f":"IF(ISBLANK(Data_Entry!B47),\"\",Data_Entry!B47)","v":""},{"$f":"IF(ISBLANK(Data_Entry!J48),\"\",Data_Entry!J48)","v":""}]
[]
[]
[]
[]
[]
[]
[]
[null,null,null,null,null,null,null,null,null,null,null,null,null,null,null,null,null,null,null,null,null,null,{"$f":"IF(ISBLANK(Data_Entry!B48),\"\",Data_Entry!B48)","v":""}]
[null,null,null,null,null,null,null,null,null,null,null,null,null,null,null,null,null,null,null,null,null,null,{"$f":"IF(ISBLANK(Data_Entry!B49),\"\",Data_Entry!B49)","v":""}]
[null,null,null,null,null,null,null,null,null,null,null,null,null,null,null,null,null,null,null,null,null,null,{"$f":"IF(ISBLANK(Data_Entry!B50),\"\",Data_Entry!B50)","v":""}]
[null,null,null,null,null,null,null,null,null,null,null,null,null,null,null,null,null,null,null,null,null,null,{"$f":"IF(ISBLANK(Data_Entry!B51),\"\",Data_Entry!B51)","v":""}]
[null,null,null,null,null,null,null,null,null,null,null,null,null,null,null,null,null,null,null,null,null,null,{"$f":"IF(ISBLANK(Data_Entry!B52),\"\",Data_Entry!B52)","v":""}]
[null,null,null,null,null,null,null,null,null,null,null,null,null,null,null,null,null,null,null,null,null,null,{"$f":"IF(ISBLANK(Data_Entry!B53),\"\",Data_Entry!B53)","v":""}]
[null,null,null,null,null,null,null,null,null,null,null,null,null,null,null,null,null,null,null,null,null,null,{"$f":"IF(ISBLANK(Data_Entry!B54),\"\",Data_Entry!B54)","v":""}]
[null,null,null,null,null,null,null,null,null,null,null,null,null,null,null,null,null,null,null,null,null,null,{"$f":"IF(ISBLANK(Data_Entry!B55),\"\",Data_Entry!B55)","v":""}]
[null,null,null,null,null,null,null,null,null,null,null,null,null,null,null,null,null,null,null,null,null,null,{"$f":"IF(ISBLANK(Data_Entry!B56),\"\",Data_Entry!B56)","v":""}]
[null,null,null,null,null,null,null,null,null,null,null,null,null,null,null,null,null,null,null,null,null,null,{"$f":"IF(ISBLANK(Data_Entry!B57),\"\",Data_Entry!B57)","v":""}]
[null,null,null,null,null,null,null,null,null,null,null,null,null,null,null,null,null,null,null,null,null,null,{"$f":"IF(ISBLANK(Data_Entry!B58),\"\",Data_Entry!B58)","v":""}]
[null,null,null,null,null,null,null,null,null,null,null,null,null,null,null,null,null,null,null,null,null,null,{"$f":"IF(ISBLANK(Data_Entry!B59),\"\",Data_Entry!B59)","v":""}]
[null,null,null,null,null,null,null,null,null,null,null,null,null,null,null,null,null,null,null,null,null,null,{"$f":"IF(ISBLANK(Data_Entry!B60),\"\",Data_Entry!B60)","v":""}]
[null,null,null,null,null,null,null,null,null,null,null,null,null,null,null,null,null,null,null,null,null,null,{"$f":"IF(ISBLANK(Data_Entry!B61),\"\",Data_Entry!B61)","v":""}]
[null,null,null,null,null,null,null,null,null,null,null,null,null,null,null,null,null,null,null,null,null,null,{"$f":"IF(ISBLANK(Data_Entry!B62),\"\",Data_Entry!B62)","v":""}]
[null,null,null,null,null,null,null,null,null,null,null,null,null,null,null,null,null,null,null,null,null,null,{"$f":"IF(ISBLANK(Data_Entry!B63),\"\",Data_Entry!B63)","v":""}]
[null,null,null,null,null,null,null,null,null,null,null,null,null,null,null,null,null,null,null,null,null,null,{"$f":"IF(ISBLANK(Data_Entry!B64),\"\",Data_Entry!B64)","v":""}]