{"text_format":"1","workbook":"xlsx","n_sheets":5,"sheets":["Data_Entry","LEGEND","Example_legends","ColorBrewer","Metadata"],"not_rendered":{"charts":0,"images":0,"macros":1,"external_links":0,"defined_names":7,"comments":1,"pivot_tables":0},"unopened":[],"bounds":{"document_bytes":16777216,"sheet_cells":100000,"rows_first":2000,"rows_last":500,"rows_between":2000,"halvings":0,"cell_chars":16384,"cell_head_chars":4096},"cells_cut":0,"cells_raw":0,"read":"whole","date_system":"1900"}

{"sheet":"Data_Entry","index":0,"n_rows":48,"n_cols":8,"rows_kept":48,"cut":false,"hidden":false,"merged":[]}
["GLOBE Global Variable Metadata Template"]
["Version: April 16, 2015"]
["Downloaded from:"]
["http://globe.umbc.edu/creating-globes-global-variables/"]
[]
["INSTRUCTIONS:"]
["1) Fill-in the requested metadata in the Enter Data column. Example text is provided below, and for other variables at right."]
["2) Produce a map legend using the LEGEND sheet, as described on that sheet."]
["3) When all of the Enter Data cells have been entered, and the LEGEND sheet is completed, this template is complete,"]
["4) Please save this file and rename it by replacing \"TEMPLATE_\" with \"Label_\" (as in Enter Data below)"]
[]
[]
[]
[null,null,null,null,null,"Examples"]
[]
["Metadata","Enter Data","Standards for Data","Link to more information",null,"ESRI World Regions","Forest cover loss (2000 to 2005)","Biogeographic Realms"]
["Type","H","M = metadata, S = land/water, C = climate, H = human, B = biological, R = remote sensing",null,null,"H","H","B"]
["Label","esri_wr25","10 character variable name: no spaces or special characters allowed, except \"_\"",null,null,"esri_wr25","deforest05","wwf_realms"]
["Variable","World Regions (ESRI 25)","A full name for the variable: up to 255 characters",null,null,"World Regions (ESRI 25)","Forest cover loss (2000 to 2005)","Biogeographic Realms"]
["Units","regions","The units of the variable, for example: %, kg/ha, regions, biomes, persons per square kilometer,….",null,null,"regions","%","Realms"]
{"$rows_left_out":29}
{"sheet":"LEGEND","index":1,"n_rows":72,"n_cols":31,"rows_kept":72,"cut":false,"hidden":false,"merged":[]}
["MAP LEGEND for GLOBAL VARIABLE"]
["Create a standard map legend for viewing the variable in GLOBE"]
[">> To get started, look at the Example Legends sheet for examples of different map legends"]
[">> Up to 50 different colors/categories/symbols can be used for a single variable using this template: if more are needed, please contact globe@umbc.edu for help."]
["1) First, enter the total number of colors/categories/symbols/bins that you intend to use in the red box below. "]
["2) Enter/paste the LOW and HIGH values for each color/category/symbol.  Note: for nominal and ordinal data, low and high values are generally equal: see Examples below"]
["3) Enter/paste the LABEL for each color/category/symbol.  For continuous variables, this can be specified, but if it is left blank, the RANGE will be used."]
["4) DELETE: any example text remaining in the template below within the hatched area (extra LOW/HIGH/LABEL/R/G/B)."]
["5) Enter/paste the Red (R), Green (G), and Blue (B) values for each color/category/symbol.  "]
[null,"There are two major ways to generate the RGB colors for your map:"]
[null,"A) Use colors or select a color legend from the ColorBrewer Sheet."]
[null,"B) Use ArcGIS or another GIS to create map symbols with RGB colors; then cut and paste the color codes. (For ArcGIS, Export the Colormap as a .CLR file- this contains the RGB codes)."]
[null,null,"or try this","http://www.rapidtables.com/web/color/RGB_Color.htm"]
[]
["MAP LEGEND TEMPLATE"]
[]
[null,25,"Number of colors/categories/symbols for the map legend ",null,null,null,null,null,null,null,null,null,null,null,null,null,null,null,null,null,null,"BINLABELS =",{"$f":"\"[\"\"\"&IF(ISBLANK(E23),\"\",E23)&IF(ISBLANK(E24),\"\",\"\"\",\"\"\"&E24)&IF(ISBLANK(E25),\"\",\"\"\",\"\"\"&E25)&IF(ISBLANK(E26),\"\",\"\"\",\"\"\"&E26)&IF(ISBLANK(E27),\"\",\"\"\",\"\"\"&E27)&IF(ISBLANK(E28),\"\",\"\"\",\"\"\"&E28)&IF(ISBLANK(E29),\"\",\"\"\",\"\"\"&E29)&IF(ISBLANK(E30),\"\",\"\"\",\"\"\"&E30)&IF(ISBLANK(E31),\"\",\"\"\",\"\"\"&E31)&IF(ISBLANK(E32),\"\",\"\"\",\"\"\"&E32)&IF(ISBLANK(E33),\"\",\"\"\",\"\"\"&E33)&IF(ISBLANK(E34),\"\",\"\"\",\"\"\"&E34)&IF(ISBLANK(E35),\"\",\"\"\",\"\"\"&E35)&IF(ISBLANK(E36),\"\",\"\"\",\"\"\"&E36)&IF(ISBLANK(E37),\"\",\"\"\",\"\"\"&E37)&IF(ISBLANK(E38),\"\",\"\"\",\"\"\"&E38)&IF(ISBLANK(E39),\"\",\"\"\",\"\"\"&E39)&IF(ISBLANK(E40),\"\",\"\"\",\"\"\"&E40)&IF(ISBLANK(E41),\"\",\"\"\",\"\"\"&E41)&IF(ISBLANK(E42),\"\",\"\"\",\"\"\"&E42)&IF(ISBLANK(E43),\"\",\"\"\",\"\"\"&E43)&IF(ISBLANK(E44),\"\",\"\"\",\"\"\"&E44)&IF(ISBLANK(E45),\"\",\"\"\",\"\"\"&E45)&IF(ISBLANK(E46),\"\",\"\"\",\"\"\"&E46)&IF(ISBLANK(E47),\"\",\"\"\",\"\"\"&E47)&IF(ISBLANK(E48),\"\",\"\"\",\"\"\"&E48)&IF(ISBLANK(E49),\"\",\"\"\",\"\"\"&E49)&IF(ISBLANK(E50),\"\",\"\"\",\"\"\"&E50)&IF(ISBLANK(E51),\"\",\"\"\",\"\"\"&E51)&IF(ISBLANK(E52),\"\",\"\"\",\"\"\"&E52)&IF(ISBLANK(E53),\"\",\"\"\",\"\"\"&E53)&IF(ISBLANK(E54),\"\",\"\"\",\"\"\"&E54)&IF(ISBLANK(E55),\"\",\"\"\",\"\"\"&E55)&IF(ISBLANK(E56),\"\",\"\"\",\"\"\"&E56)&IF(ISBLANK(E57),\"\",\"\"\",\"\"\"&E57)&IF(ISBLANK(E58),\"\",\"\"\",\"\"\"&E58)&IF(ISBLANK(E59),\"\",\"\"\",\"\"\"&E59)&IF(ISBLANK(E60),\"\",\"\"\",\"\"\"&E60)&IF(ISBLANK(E61),\"\",\"\"\",\"\"\"&E61)&IF(ISBLANK(E62),\"\",\"\"\",\"\"\"&E62)&IF(ISBLANK(E63),\"\",\"\"\",\"\"\"&E63)&IF(ISBLANK(E64),\"\",\"\"\",\"\"\"&E64)&IF(ISBLANK(E65),\"\",\"\"\",\"\"\"&E65)&IF(ISBLANK(E66),\"\",\"\"\",\"\"\"&E66)&IF(ISBLANK(E67),\"\",\"\"\",\"\"\"&E67)&IF(ISBLANK(E68),\"\",\"\"\",\"\"\"&E68)&IF(ISBLANK(E69),\"\",\"\"\",\"\"\"&E69)&IF(ISBLANK(E70),\"\",\"\"\",\"\"\"&E70)&IF(ISBLANK(E71),\"\",\"\"\",\"\"\"&E71)&IF(ISBLANK(E72),\"\",\"\"\",\"\"\"&E72)&\"\"\"]\"","v":"[\"Antarctica\",\"Asiatic Russia\",\"Australia/New Zealand\",\"Caribbean\",\"Central America\",\"Central Asia\",\"Eastern Africa\",\"Eastern Asia\",\"Eastern Europe\",\"European Russia\",\"Melanesia\",\"Micronesia\",\"Middle Africa\",\"Northern Africa\",\"Northern America\",\"Northern Europe\",\"Polynesia\",\"South America\",\"Southeastern Asia\",\"Southern Africa\",\"Southern Asia\",\"Southern Europe\",\"Western Africa\",\"Western Asia\",\"Western Europe\"]"}]
["Blue text cells are not editable: they are updated automatically",null,null,null,null,null,null,null,null,null,null,null,null,null,null,null,null,null,null,null,null,"BINS = ",{"$f":"IF(D23=\"\",\"\",D23)&IF(D24=\"\",\"\",\",\"&D24)&IF(D25=\"\",\"\",\",\"&D25)&IF(D26=\"\",\"\",\",\"&D26)&IF(D27=\"\",\"\",\",\"&D27)&IF(D28=\"\",\"\",\",\"&D28)&IF(D29=\"\",\"\",\",\"&D29)&IF(D30=\"\",\"\",\",\"&D30)&IF(D31=\"\",\"\",\",\"&D31)&IF(D32=\"\",\"\",\",\"&D32)&IF(D33=\"\",\"\",\",\"&D33)&IF(D34=\"\",\"\",\",\"&D34)&IF(D35=\"\",\"\",\",\"&D35)&IF(D36=\"\",\"\",\",\"&D36)&IF(D37=\"\",\"\",\",\"&D37)&IF(D38=\"\",\"\",\",\"&D38)&IF(D39=\"\",\"\",\",\"&D39)&IF(D40=\"\",\"\",\",\"&D40)&IF(D41=\"\",\"\",\",\"&D41)&IF(D42=\"\",\"\",\",\"&D42)&IF(D43=\"\",\"\",\",\"&D43)&IF(D44=\"\",\"\",\",\"&D44)&IF(D45=\"\",\"\",\",\"&D45)&IF(D46=\"\",\"\",\",\"&D46)&IF(D47=\"\",\"\",\",\"&D47)&IF(D48=\"\",\"\",\",\"&D48)&IF(D49=\"\",\"\",\",\"&D49)&IF(D50=\"\",\"\",\",\"&D50)&IF(D51=\"\",\"\",\",\"&D51)&IF(D52=\"\",\"\",\",\"&D52)&IF(D53=\"\",\"\",\",\"&D53)&IF(D54=\"\",\"\",\",\"&D54)&IF(D55=\"\",\"\",\",\"&D55)&IF(D56=\"\",\"\",\",\"&D56)&IF(D57=\"\",\"\",\",\"&D57)&IF(D58=\"\",\"\",\",\"&D58)&IF(D59=\"\",\"\",\",\"&D59)&IF(D60=\"\",\"\",\",\"&D60)&IF(D61=\"\",\"\",\",\"&D61)&IF(D62=\"\",\"\",\",\"&D62)&IF(D63=\"\",\"\",\",\"&D63)&IF(D64=\"\",\"\",\",\"&D64)&IF(D65=\"\",\"\",\",\"&D65)&IF(D66=\"\",\"\",\",\"&D66)&IF(D67=\"\",\"\",\",\"&D67)&IF(D68=\"\",\"\",\",\"&D68)&IF(D69=\"\",\"\",\",\"&D69)&IF(D70=\"\",\"\",\",\"&D70)&IF(D71=\"\",\"\",\",\"&D71)&IF(D72=\"\",\"\",\",\"&D72)","v":"1:1,2:2,3:3,4:4,5:5,6:6,7:7,8:8,9:9,10:10,11:11,12:12,13:13,14:14,15:15,16:16,17:17,18:18,19:19,20:20,21:21,22:22,23:23,24:24,25:25"}]
["If more than 50 categories are needed for the legend, please contact globe@umbc.edu for help.",null,null,null,null,null,null,null,null,null,null,null,null,null,null,null,null,null,null,null,null,"COLORING (HEX) = ",{"$f":"IF(J23=\"\",\"\",J23)&IF(J24=\"\",\"\",\",\"&J24)&IF(J25=\"\",\"\",\",\"&J25)&IF(J26=\"\",\"\",\",\"&J26)&IF(J27=\"\",\"\",\",\"&J27)&IF(J28=\"\",\"\",\",\"&J28)&IF(J29=\"\",\"\",\",\"&J29)&IF(J30=\"\",\"\",\",\"&J30)&IF(J31=\"\",\"\",\",\"&J31)&IF(J32=\"\",\"\",\",\"&J32)&IF(J33=\"\",\"\",\",\"&J33)&IF(J34=\"\",\"\",\",\"&J34)&IF(J35=\"\",\"\",\",\"&J35)&IF(J36=\"\",\"\",\",\"&J36)&IF(J37=\"\",\"\",\",\"&J37)&IF(J38=\"\",\"\",\",\"&J38)&IF(J39=\"\",\"\",\",\"&J39)&IF(J40=\"\",\"\",\",\"&J40)&IF(J41=\"\",\"\",\",\"&J41)&IF(J42=\"\",\"\",\",\"&J42)&IF(J43=\"\",\"\",\",\"&J43)&IF(J44=\"\",\"\",\",\"&J44)&IF(J45=\"\",\"\",\",\"&J45)&IF(J46=\"\",\"\",\",\"&J46)&IF(J47=\"\",\"\",\",\"&J47)&IF(J48=\"\",\"\",\",\"&J48)&IF(J49=\"\",\"\",\",\"&J49)&IF(J50=\"\",\"\",\",\"&J50)&IF(J51=\"\",\"\",\",\"&J51)&IF(J52=\"\",\"\",\",\"&J52)&IF(J53=\"\",\"\",\",\"&J53)&IF(J54=\"\",\"\",\",\"&J54)&IF(J55=\"\",\"\",\",\"&J55)&IF(J56=\"\",\"\",\",\"&J56)&IF(J57=\"\",\"\",\",\"&J57)&IF(J58=\"\",\"\",\",\"&J58)&IF(J59=\"\",\"\",\",\"&J59)&IF(J60=\"\",\"\",\",\"&J60)&IF(J61=\"\",\"\",\",\"&J61)&IF(J62=\"\",\"\",\",\"&J62)&IF(J63=\"\",\"\",\",\"&J63)&IF(J64=\"\",\"\",\",\"&J64)&IF(J65=\"\",\"\",\",\"&J65)&IF(J66=\"\",\"\",\",\"&J66)&IF(J67=\"\",\"\",\",\"&J67)&IF(J68=\"\",\"\",\",\"&J68)&IF(J69=\"\",\"\",\",\"&J69)&IF(J70=\"\",\"\",\",\"&J70)&IF(J71=\"\",\"\",\",\"&J71)&IF(J72=\"\",\"\",\",\"&J72)","v":"0xE1E1E1,0x07DEA4,0x2816F0,0xEDDB34,0x2774D9,0xFFFF73,0x54F224,0xE825D5,0xCD8966,0xA9D1D6,0x280D54,0xDB0B1C,0x8C7238,0xE4AEFC,0xAEDB81,0x8057E6,0x13B5CF,0x38A800,0x664773,0x898C88,0x700604,0xEFE4BE,0xF52265,0xCDCD66,0xE065CA"}]
[null,null,null,null,null,null,null,null,null,null,null,null,null,null,null,null,null,null,null,null,null,"CATEGORIES = ",{"$f":"\"{ \"\"No Data\"\": \"&Data_Entry!B33&\", \"&IF(K23=\"\",\"\",K23)&IF(K24=\"\",\"\",\", \"&K24)&IF(K25=\"\",\"\",\", \"&K25)&IF(K26=\"\",\"\",\", \"&K26)&IF(K27=\"\",\"\",\", \"&K27)&IF(K28=\"\",\"\",\", \"&K28)&IF(K29=\"\",\"\",\", \"&K29)&IF(K30=\"\",\"\",\", \"&K30)&IF(K31=\"\",\"\",\", \"&K31)&IF(K32=\"\",\"\",\", \"&K32)&IF(K33=\"\",\"\",\", \"&K33)&IF(K34=\"\",\"\",\", \"&K34)&IF(K35=\"\",\"\",\", \"&K35)&IF(K36=\"\",\"\",\", \"&K36)&IF(K37=\"\",\"\",\", \"&K37)&IF(K38=\"\",\"\",\", \"&K38)&IF(K39=\"\",\"\",\", \"&K39)&IF(K40=\"\",\"\",\", \"&K40)&IF(K41=\"\",\"\",\", \"&K41)&IF(K42=\"\",\"\",\", \"&K42)&IF(K43=\"\",\"\",\", \"&K43)&IF(K44=\"\",\"\",\", \"&K44)&IF(K45=\"\",\"\",\", \"&K45)&IF(K46=\"\",\"\",\", \"&K46)&IF(K47=\"\",\"\",\", \"&K47)&IF(K48=\"\",\"\",\", \"&K48)&IF(K49=\"\",\"\",\", \"&K49)&IF(K50=\"\",\"\",\", \"&K50)&IF(K51=\"\",\"\",\", \"&K51)&IF(K52=\"\",\"\",\", \"&K52)&IF(K53=\"\",\"\",\", \"&K53)&IF(K54=\"\",\"\",\", \"&K54)&IF(K55=\"\",\"\",\", \"&K55)&IF(K56=\"\",\"\",\", \"&K56)&IF(K57=\"\",\"\",\", \"&K57)&IF(K58=\"\",\"\",\", \"&K58)&IF(K59=\"\",\"\",\", \"&K59)&IF(K60=\"\",\"\",\", \"&K60)&IF(K61=\"\",\"\",\", \"&K61)&IF(K62=\"\",\"\",\", \"&K62)&IF(K63=\"\",\"\",\", \"&K63)&IF(K64=\"\",\"\",\", \"&K64)&IF(K65=\"\",\"\",\", \"&K65)&IF(K66=\"\",\"\",\", \"&K66)&IF(K67=\"\",\"\",\", \"&K67)&IF(K68=\"\",\"\",\", \"&K68)&IF(K69=\"\",\"\",\", \"&K69)&IF(K70=\"\",\"\",\", \"&K70)&IF(K71=\"\",\"\",\", \"&K71)&IF(K72=\"\",\"\",\", \"&K72)&\"}\"","v":"{ \"No Data\": 0, \"Antarctica\": 1, \"Asiatic Russia\": 2, \"Australia/New Zealand\": 3, \"Caribbean\": 4, \"Central America\": 5, \"Central Asia\": 6, \"Eastern Africa\": 7, \"Eastern Asia\": 8, \"Eastern Europe\": 9, \"European Russia\": 10, \"Melanesia\": 11, \"Micronesia\": 12, \"Middle Africa\": 13, \"Northern Africa\": 14, \"Northern America\": 15, \"Northern Europe\": 16, \"Polynesia\": 17, \"South America\": 18, \"Southeastern Asia\": 19, \"Southern Africa\": 20, \"Southern Asia\": 21, \"Southern Europe\": 22, \"Western Africa\": 23, \"Western Asia\": 24, \"Western Europe\": 25}"}]
{"$rows_left_out":53}
{"sheet":"Example_legends","index":2,"n_rows":219,"n_cols":31,"rows_kept":219,"cut":false,"hidden":false,"merged":[]}
["Examples of MAP LEGENDs for GLOBAL VARIABLEs"]
["Create a standard map legend for viewing the variable in GLOBE"]
[null,null,null,null,null,null,null,null,null,null,null,null,null,null,null,null,null,null,null,null,null,null,null,null,null,null,null,null,null,null,{"$f":"#REF!&#REF!&#REF!&#REF!&#REF!&#REF!&#REF!&#REF!&#REF!&#REF!&#REF!&#REF!&#REF!&#REF!&#REF!&#REF!&#REF!&#REF!&#REF!&#REF!&#REF!&#REF!&#REF!&#REF!&#REF!&#REF!&#REF!&#REF!&#REF!&#REF!&#REF!&#REF!&#REF!&#REF!&#REF!&#REF!&#REF!&#REF!&#REF!&#REF!&#REF!&#REF!&#REF!&#REF!&#REF!&#REF!&#REF!&#REF!&#REF!&#REF!","v":{"$error":"#REF!"}}]
["EXAMPLE LEGENDS"]
[]
["ESRI 25 World Regions"]
[]
["#","LOW","HIGH","RANGE","LABEL","R","G","B","COLOR","HEX","CATEGORIES"]
[1,1,1,{"$f":"B9&\":\"&C9","v":"1:1"},"Antarctica",225,225,225,null,{"$f":"\"0x\"&DEC2HEX(F9,2)&DEC2HEX(G9,2)&DEC2HEX(H9,2)","v":"0xE1E1E1"},{"$f":"\"\"\"\"&E9&\"\"\": \"&B9","v":"\"Antarctica\": 1"}]
[2,2,2,"2:2","Asiatic Russia",7,222,164,null,"0x07DEA4",{"$f":"\"\"\"\"&E10&\"\"\": \"&B10","v":"\"Asiatic Russia\": 2"}]
[3,3,3,"3:3","Australia/New Zealand",40,22,240,null,"0x2816F0","\"Australia/New Zealand\": 3"]
[4,4,4,"4:4","Caribbean",237,219,52,null,"0xEDDB34","\"Caribbean\": 4"]
[5,5,5,"5:5","Central America",39,116,217,null,"0x2774D9","\"Central America\": 5"]
[6,6,6,"6:6","Central Asia",255,255,115,null,"0xFFFF73","\"Central Asia\": 6"]
[7,7,7,"7:7","Eastern Africa",84,242,36,null,"0x54F224","\"Eastern Africa\": 7"]
[8,8,8,"8:8","Eastern Asia",232,37,213,null,"0xE825D5","\"Eastern Asia\": 8"]
[9,9,9,"9:9","Eastern Europe",205,137,102,null,"0xCD8966","\"Eastern Europe\": 9"]
[10,10,10,"10:10","European Russia",169,209,214,null,"0xA9D1D6","\"European Russia\": 10"]
[11,11,11,"11:11","Melanesia",40,13,84,null,"0x280D54","\"Melanesia\": 11"]
[12,12,12,"12:12","Micronesia",219,11,28,null,"0xDB0B1C","\"Micronesia\": 12"]
{"$rows_left_out":200}
{"sheet":"ColorBrewer","index":3,"n_rows":1722,"n_cols":17,"rows_kept":1722,"cut":false,"hidden":false,"merged":[]}
["ColorName","NumOfColors","Type","CritVal","ColorNum","ColorLetter","R","G","B",null,"ColorPatch"]
["YlGn",3,"seq",null,1,"C",247,252,185,null,null,null,"18 Sequential Schemes"]
[null,null,null,null,2,"F",173,221,142,null,null,null,"followed by 9 Diverging and 8 Qualitative"]
[null,null,null,null,3,"I",49,163,84]
["YlGn",4,"seq",null,1,"B",255,255,204]
[null,null,null,null,2,"E",194,230,153]
[null,null,null,null,3,"G",120,198,121]
[null,null,null,null,4,"J",35,132,67]
["YlGn",5,"seq",null,1,"B",255,255,204]
[null,null,null,null,2,"E",194,230,153]
[null,null,null,null,3,"G",120,198,121]
[null,null,null,null,4,"I",49,163,84]
[null,null,null,null,5,"K",0,104,55]
["YlGn",6,"seq",null,1,"B",255,255,204]
[null,null,null,null,2,"D",217,240,163]
[null,null,null,null,3,"F",173,221,142]
[null,null,null,null,4,"G",120,198,121]
[null,null,null,null,5,"I",49,163,84]
[null,null,null,null,6,"K",0,104,55]
["YlGn",7,"seq",null,1,"B",255,255,204]
{"$rows_left_out":1703}
{"sheet":"Metadata","index":4,"n_rows":26,"n_cols":31,"rows_kept":26,"cut":false,"hidden":false,"merged":[]}
["type","dyn","Pub","Label","Variable","Description","Units","Source","Native","Geoprocessing Code","Extrapolated?","data type","max","min","step","coloring","bins","binlabels","missing value","categories","cite","Public_Note","p_Native","p_Extrapolated","p_NODATA","Native_Min","Native_Max","Native_Median","Native_Mean","GLOBE_Median","GLOBE_Mean"]
[{"$f":"Data_Entry!B17","v":"H"},"S","Y",{"$f":"Data_Entry!B18","v":"esri_wr25"},{"$f":"Data_Entry!B19","v":"World Regions (ESRI 25)"},{"$f":"Data_Entry!B21","v":"Boundaries for 25 commonly recognized regions of the world."},{"$f":"Data_Entry!B20","v":"regions"},{"$f":"Data_Entry!B22","v":"From ArcGIS online: http://www.arcgis.com/home/item.html?id=84dbc97915244e35808e87a881133d09"},{"$f":"Data_Entry!B26","v":"polygons"},{"$f":"Data_Entry!B27","v":5},{"$f":"Data_Entry!B28","v":"y"},{"$f":"Data_Entry!B29","v":"nominal"},{"$f":"Data_Entry!B31","v":25},{"$f":"Data_Entry!B30","v":1},{"$f":"Data_Entry!B32","v":1},{"$f":"LEGEND!W19","v":"0xE1E1E1,0x07DEA4,0x2816F0,0xEDDB34,0x2774D9,0xFFFF73,0x54F224,0xE825D5,0xCD8966,0xA9D1D6,0x280D54,0xDB0B1C,0x8C7238,0xE4AEFC,0xAEDB81,0x8057E6,0x13B5CF,0x38A800,0x664773,0x898C88,0x700604,0xEFE4BE,0xF52265,0xCDCD66,0xE065CA"},{"$f":"LEGEND!W18","v":"1:1,2:2,3:3,4:4,5:5,6:6,7:7,8:8,9:9,10:10,11:11,12:12,13:13,14:14,15:15,16:16,17:17,18:18,19:19,20:20,21:21,22:22,23:23,24:24,25:25"},{"$f":"LEGEND!W17","v":"[\"Antarctica\",\"Asiatic Russia\",\"Australia/New Zealand\",\"Caribbean\",\"Central America\",\"Central Asia\",\"Eastern Africa\",\"Eastern Asia\",\"Eastern Europe\",\"European Russia\",\"Melanesia\",\"Micronesia\",\"Middle Africa\",\"Northern Africa\",\"Northern America\",\"Northern Europe\",\"Polynesia\",\"South America\",\"Southeastern Asia\",\"Southern Africa\",\"Southern Asia\",\"Southern Europe\",\"Western Africa\",\"Western Asia\",\"Western Europe\"]"},{"$f":"Data_Entry!B33","v":0},{"$f":"LEGEND!W20","v":"{ \"No Data\": 0, \"Antarctica\": 1, \"Asiatic Russia\": 2, \"Australia/New Zealand\": 3, \"Caribbean\": 4, \"Central America\": 5, \"Central Asia\": 6, \"Eastern Africa\": 7, \"Eastern Asia\": 8, \"Eastern Europe\": 9, \"European Russia\": 10, \"Melanesia\": 11, \"Micronesia\": 12, \"Middle Africa\": 13, \"Northern Africa\": 14, \"Northern America\": 15, \"Northern Europe\": 16, \"Polynesia\": 17, \"South America\": 18, \"Southeastern Asia\": 19, \"Southern Africa\": 20, \"Southern Asia\": 21, \"Southern Europe\": 22, \"Western Africa\": 23, \"Western Asia\": 24, \"Western Europe\": 25}"},{"$f":"Data_Entry!B24","v":"ESRI. World Regions. http://www.arcgis.com/home/item.html?id=84dbc97915244e35808e87a881133d09 <downloaded April 2, 2014>"},{"$f":"Data_Entry!B39","v":"Use with reference to ESRI"},{"$f":"IF(ISBLANK(Data_Entry!B40),\"\",Data_Entry!B40)","v":""},{"$f":"IF(ISBLANK(Data_Entry!B41),\"\",Data_Entry!B41)","v":""},{"$f":"IF(ISBLANK(Data_Entry!B42),\"\",Data_Entry!B42)","v":""},{"$f":"IF(ISBLANK(Data_Entry!B43),\"\",Data_Entry!B43)","v":1},{"$f":"IF(ISBLANK(Data_Entry!B44),\"\",Data_Entry!B44)","v":25},{"$f":"IF(ISBLANK(Data_Entry!B45),\"\",Data_Entry!B45)","v":""},{"$f":"IF(ISBLANK(Data_Entry!B46),\"\",Data_Entry!B46)","v":""},{"$f":"IF(ISBLANK(Data_Entry!B47),\"\",Data_Entry!B47)","v":""},{"$f":"IF(ISBLANK(Data_Entry!J48),\"\",Data_Entry!J48)","v":""}]
[]
[]
[]
[]
[]
[]
[]
[null,null,null,null,null,null,null,null,null,null,null,null,null,null,null,null,null,null,null,null,null,null,{"$f":"IF(ISBLANK(Data_Entry!B48),\"\",Data_Entry!B48)","v":""}]
[null,null,null,null,null,null,null,null,null,null,null,null,null,null,null,null,null,null,null,null,null,null,{"$f":"IF(ISBLANK(Data_Entry!B49),\"\",Data_Entry!B49)","v":""}]
[null,null,null,null,null,null,null,null,null,null,null,null,null,null,null,null,null,null,null,null,null,null,{"$f":"IF(ISBLANK(Data_Entry!B50),\"\",Data_Entry!B50)","v":""}]
[null,null,null,null,null,null,null,null,null,null,null,null,null,null,null,null,null,null,null,null,null,null,{"$f":"IF(ISBLANK(Data_Entry!B51),\"\",Data_Entry!B51)","v":""}]
[null,null,null,null,null,null,null,null,null,null,null,null,null,null,null,null,null,null,null,null,null,null,{"$f":"IF(ISBLANK(Data_Entry!B52),\"\",Data_Entry!B52)","v":""}]
[null,null,null,null,null,null,null,null,null,null,null,null,null,null,null,null,null,null,null,null,null,null,{"$f":"IF(ISBLANK(Data_Entry!B53),\"\",Data_Entry!B53)","v":""}]
[null,null,null,null,null,null,null,null,null,null,null,null,null,null,null,null,null,null,null,null,null,null,{"$f":"IF(ISBLANK(Data_Entry!B54),\"\",Data_Entry!B54)","v":""}]
[null,null,null,null,null,null,null,null,null,null,null,null,null,null,null,null,null,null,null,null,null,null,{"$f":"IF(ISBLANK(Data_Entry!B55),\"\",Data_Entry!B55)","v":""}]
[null,null,null,null,null,null,null,null,null,null,null,null,null,null,null,null,null,null,null,null,null,null,{"$f":"IF(ISBLANK(Data_Entry!B56),\"\",Data_Entry!B56)","v":""}]
[null,null,null,null,null,null,null,null,null,null,null,null,null,null,null,null,null,null,null,null,null,null,{"$f":"IF(ISBLANK(Data_Entry!B57),\"\",Data_Entry!B57)","v":""}]
[null,null,null,null,null,null,null,null,null,null,null,null,null,null,null,null,null,null,null,null,null,null,{"$f":"IF(ISBLANK(Data_Entry!B58),\"\",Data_Entry!B58)","v":""}]
{"$rows_left_out":6}